Android not able to test on android

Discussion in 'GameMaker Studio 2 Community Tech Support' started by zim32, Jan 7, 2019.

  1. zim32

    zim32 Member

    Joined:
    May 23, 2018
    Posts:
    83
    I used to be able to test things on the android just fine but now when i try to I get this

    "cmd" /c subst W: "C:\Users\kyle\AppData\Roaming\GameMakerStudio2\Cache\GMS2CACHE"

    elapsed time 00:00:00.1597898s for command "cmd" /c subst W: "C:\Users\kyle\AppData\Roaming\GameMakerStudio2\Cache\GMS2CACHE" started at 01/05/2019 10:35:12
    "cmd" /c subst V: "C:\Users\kyle\AppData\Local\GameMakerStudio2\GMS2TEMP"

    elapsed time 00:00:00.1318290s for command "cmd" /c subst V: "C:\Users\kyle\AppData\Local\GameMakerStudio2\GMS2TEMP" started at 01/05/2019 10:35:12
    "cmd" /c subst U: "C:\ProgramData\GameMakerStudio2\Cache\runtimes\runtime-2.2.1.291"

    elapsed time 00:00:00.1400732s for command "cmd" /c subst U: "C:\ProgramData\GameMakerStudio2\Cache\runtimes\runtime-2.2.1.291" started at 01/05/2019 10:35:12
    Saving project to: C:\Users\kyle\Documents\GameMakerStudio2\mobile test\mobile test.yyp
    "C:\ProgramData\GameMakerStudio2\Cache\runtimes\runtime-2.2.1.291/bin/Igor.exe" -options="C:\Users\kyle\AppData\Local\GameMakerStudio2\GMS2TEMP\build.bff" -- Android Run

    Loaded Macros from C:\Users\kyle\AppData\Roaming\GameMakerStudio2\Cache\GMS2CACHE\mobile_tes_86D3BDC_9DE7FCEE\macros.json
    Options: U:/bin\platform_setting_defaults.json
    Options: C:\Users\kyle\AppData\Roaming/GameMakerStudio2\zim.irk84_1624689\local_settings.json
    Options: C:\Users\kyle\AppData\Roaming\GameMakerStudio2\Cache\GMS2CACHE\mobile_tes_86D3BDC_9DE7FCEE\targetoptions.json
    U://bin/GMAssetCompiler.exe /c /zpex /mv=1 /iv=0 /rv=0 /bv=0 /j=4 /gn="mobile test" /td="V:/" /cd="W:/mobile_tes_86D3BDC_9DE7FCEE" /zpuf="C:\Users\kyle\AppData\Roaming/GameMakerStudio2\zim.irk84_1624689" /m=llvm-android /tgt=8 /llvmSource="U://yyc/" /nodnd /cfg="default" /fU="W:/mobile_tes_86D3BDC_9DE7FCEE\functionsUsed.txt" /o="V:/mobile_test_1ABA3107_YYC" /optionsini="V:/mobile_test_1ABA3107_YYC\options.ini" /baseproject="U:/BaseProject\BaseProject.yyp" "C:\Users\kyle\Documents\GameMakerStudio2\mobile test\mobile test.yyp" /preprocess="W:/mobile_tes_86D3BDC_9DE7FCEE"
    Reading project file....C:\Users\kyle\Documents\GameMakerStudio2\mobile test
    Reading project file....U:\BaseProject
    Reading config delta 'C:\Users\kyle\Documents\GameMakerStudio2\mobile test\options\main\inherited\options_main.inherited.yy'
    finished.


    U://bin/GMAssetCompiler.exe DONE (0)
    Release build
    PlatformOptions
    Options: W:/mobile_tes_86D3BDC_9DE7FCEE\PlatformOptions.json
    Options: W:/mobile_tes_86D3BDC_9DE7FCEE\MainOptions.json
    displayname
    hostname
    runtime
    working dir: C:\Program Files\GameMaker Studio 2
    C:\Users\kyle\AppData\Local\Android\Sdk\platform-tools\adb devices
    OptionsIni
    PlatformOptions
    working dir: C:\Program Files\GameMaker Studio 2
    C:\Users\kyle\AppData\Local\Android\Sdk\platform-tools\adb -s "ZY224NJVPF" shell getprop ro.product.cpu.abilist
    U://bin/GMAssetCompiler.exe /c /zpex /mv=1 /iv=0 /rv=0 /bv=0 /j=4 /gn="mobile test" /td="V:/" /cd="W:/mobile_tes_86D3BDC_9DE7FCEE" /zpuf="C:\Users\kyle\AppData\Roaming/GameMakerStudio2\zim.irk84_1624689" /m=llvm-android /tgt=8 /llvmSource="U://yyc/" /nodnd /cfg="default" /fU="W:/mobile_tes_86D3BDC_9DE7FCEE\functionsUsed.txt" /o="V:/mobile_test_1ABA3107_YYC" /optionsini="V:/mobile_test_1ABA3107_YYC\options.ini" /baseproject="U:/BaseProject\BaseProject.yyp" "C:\Users\kyle\Documents\GameMakerStudio2\mobile test\mobile test.yyp" /arch=2 /bt=exe
    Reading project file....C:\Users\kyle\Documents\GameMakerStudio2\mobile test
    Reading project file....U:\BaseProject
    Reading config delta 'C:\Users\kyle\Documents\GameMakerStudio2\mobile test\options\main\inherited\options_main.inherited.yy'
    finished.
    Compile Constants...finished.
    Remove DnD...finished.
    Compile Scripts...finished.
    Compile Objects...finished.
    Compile Timelines...finished.
    Compile Triggers...finished.
    Compile Rooms...finished.
    Compile Extensions...finished.
    Global scripts...finished.
    collapsing enums.
    Final Compile...finished.
    Writing Chunk... GEN8
    option_game_speed=30
    Writing Chunk... OPTN
    Writing Chunk... LANG
    Writing Chunk... EXTN
    Writing Chunk... SOND
    Writing Chunk... AGRP
    Writing Chunk... SPRT
    Writing Chunk... BGND
    Writing Chunk... PATH
    Writing Chunk... SCPT
    Writing Chunk... GLOB
    Writing Chunk... SHDR
    Writing Chunk... FONT
    Writing Chunk... TMLN
    Writing Chunk... OBJT
    Writing Chunk... ROOM
    Writing Chunk... DAFL
    Writing Chunk... EMBI
    Writing Chunk... TPAGE
    Texture Group - Default
    Writing Chunk... TGIN
    Writing Chunk... STRG
    Writing Chunk... TXTR
    0 Compressing texture... writing texture texture_0.png...
    Writing Chunk... AUDO
    ClangExeLocation=C:\Users\kyle\android-ndk-r17\toolchains\llvm\prebuilt\windows\bin\clang++.exe
    Using NDKDir = C:\Users\kyle\android-ndk-r17
    Using PlatformDir = C:\Users\kyle\android-ndk-r17\platforms\android-28
    Using ARMToolChain = C:\Users\kyle\android-ndk-r17\toolchains\arm-linux-androideabi-4.9\prebuilt\windows
    saving file V:/mobile_test_1ABA3107_YYC\mobile test.droid
    [armeabi-v7a] "Compile++ arm ": "yoyo <= gml_Object_obj_wisp1_PreCreate_0.gml.cpp"
    [armeabi-v7a] "Compile++ arm ": "yoyo <= gml_Object_obj_wisp2_Create_0.gml.cpp"
    [armeabi-v7a] "Compile++ arm ": "yoyo <= gml_Object_obj_wisp2_Step_0.gml.cpp"
    process_begin: CreateProcess(NULL, C:/Users/kyle/android-ndk-r17/build//../toolchains/llvm/prebuilt/windows-x86_64/bin/clang++.exe -MMD -MP -MF ./obj/local/armeabi-v7a/objs/yoyo/gml_Object_obj_wisp1_PreCreate_0.gml.o.d -gcc-toolchain C:/Users/kyle/android-ndk-r17/build//../toolchains/arm-linux-androideabi-4.9/prebuilt/windows-x86_64 -fpic -ffunction-sections -funwind-tables -fstack-protector-strong -Wno-invalid-command-line-argument -Wno-unused-command-line-argument -no-canonical-prefixes -g -target armv7-none-linux-androideabi14 -march=armv7-a -mfloat-abi=softfp -mfpu=vfpv3-d16 -fno-exceptions -fno-rtti -marm -O2 -DNDEBUG -IU://yyc/include -IC:/Users/kyle/android-ndk-r17/build//../sources/cxx-stl/llvm-libc++/include -IC:/Users/kyle/android-ndk-r17/build//../sources/cxx-stl/llvm-libc++/../llvm-libc++abi/include -IC:/Users/kyle/android-ndk-r17/build//../sources/android/support/include -Ijni/libyoyo/../.. -std=c++11 -DANDROID -c -DYYLLVM=1 -DANDROID_NDK=1 -Wno-tautological-pointer-compare -Wno-parentheses-equal
    ity -Wno-deprecated-writable-strings -funsigned-char -D__ANDROID_API__=14 -Wa,--noexecstack -Wformat -Werror=format-security --sysroot C:/Users/kyle/android-ndk-r17/build//../sysroot -isystem C:/Users/kyle/android-ndk-r17/build//../sysroot/usr/include/arm-linux-androideabi -c jni/libyoyo/../../gml_Object_obj_wisp1_PreCreate_0.gml.cpp -o ./obj/local/armeabi-v7a/objs/yoyo/gml_Object_obj_wisp1_PreCreate_0.gml.o, ...) failed.
    make (e=2): The system cannot find the file specified.
    make: *** [obj/local/armeabi-v7a/objs/yoyo/gml_Object_obj_wisp1_PreCreate_0.gml.o] Error 2
    make: *** Waiting for unfinished jobs....
    process_begin: CreateProcess(NULL, C:/Users/kyle/android-ndk-r17/build//../toolchains/llvm/prebuilt/windows-x86_64/bin/clang++.exe -MMD -MP -MF ./obj/local/armeabi-v7a/objs/yoyo/gml_Object_obj_wisp2_Create_0.gml.o.d -gcc-toolchain C:/Users/kyle/android-ndk-r17/build//../toolchains/arm-linux-androideabi-4.9/prebuilt/windows-x86_64 -fpic -ffunction-sections -funwind-tables -fstack-protector-strong -Wno-invalid-command-line-argument -Wno-unused-command-line-argument -no-canonical-prefixes -g -target armv7-none-linux-androideabi14 -march=armv7-a -mfloat-abi=softfp -mfpu=vfpv3-d16 -fno-exceptions -fno-rtti -marm -O2 -DNDEBUG -IU://yyc/include -IC:/Users/kyle/android-ndk-r17/build//../sources/cxx-stl/llvm-libc++/include -IC:/Users/kyle/android-ndk-r17/build//../sources/cxx-stl/llvm-libc++/../llvm-libc++abi/include -IC:/Users/kyle/android-ndk-r17/build//../sources/android/support/include -Ijni/libyoyo/../.. -std=c++11 -DANDROID -c -DYYLLVM=1 -DANDROID_NDK=1 -Wno-tautological-pointer-compare -Wno-parentheses-equality
    -Wno-deprecated-writable-strings -funsigned-char -D__ANDROID_API__=14 -Wa,--noexecstack -Wformat -Werror=format-security --sysroot C:/Users/kyle/android-ndk-r17/build//../sysroot -isystem C:/Users/kyle/android-ndk-r17/build//../sysroot/usr/include/arm-linux-androideabi -c jni/libyoyo/../../gml_Object_obj_wisp2_Create_0.gml.cpp -o ./obj/local/armeabi-v7a/objs/yoyo/gml_Object_obj_wisp2_Create_0.gml.o, ...) failed.
    make (e=2): The system cannot find the file specified.
    make: *** [obj/local/armeabi-v7a/objs/yoyo/gml_Object_obj_wisp2_Create_0.gml.o] Error 2
    process_begin: CreateProcess(NULL, C:/Users/kyle/android-ndk-r17/build//../toolchains/llvm/prebuilt/windows-x86_64/bin/clang++.exe -MMD -MP -MF ./obj/local/armeabi-v7a/objs/yoyo/gml_Object_obj_wisp2_Step_0.gml.o.d -gcc-toolchain C:/Users/kyle/android-ndk-r17/build//../toolchains/arm-linux-androideabi-4.9/prebuilt/windows-x86_64 -fpic -ffunction-sections -funwind-tables -fstack-protector-strong -Wno-invalid-command-line-argument -Wno-unused-command-line-argument -no-canonical-prefixes -g -target armv7-none-linux-androideabi14 -march=armv7-a -mfloat-abi=softfp -mfpu=vfpv3-d16 -fno-exceptions -fno-rtti -marm -O2 -DNDEBUG -IU://yyc/include -IC:/Users/kyle/android-ndk-r17/build//../sources/cxx-stl/llvm-libc++/include -IC:/Users/kyle/android-ndk-r17/build//../sources/cxx-stl/llvm-libc++/../llvm-libc++abi/include -IC:/Users/kyle/android-ndk-r17/build//../sources/android/support/include -Ijni/libyoyo/../.. -std=c++11 -DANDROID -c -DYYLLVM=1 -DANDROID_NDK=1 -Wno-tautological-pointer-compare -Wno-parentheses-equality -
    Wno-deprecated-writable-strings -funsigned-char -D__ANDROID_API__=14 -Wa,--noexecstack -Wformat -Werror=format-security --sysroot C:/Users/kyle/android-ndk-r17/build//../sysroot -isystem C:/Users/kyle/android-ndk-r17/build//../sysroot/usr/include/arm-linux-androideabi -c jni/libyoyo/../../gml_Object_obj_wisp2_Step_0.gml.cpp -o ./obj/local/armeabi-v7a/objs/yoyo/gml_Object_obj_wisp2_Step_0.gml.o, ...) failed.
    make (e=2): The system cannot find the file specified.
    make: *** [obj/local/armeabi-v7a/objs/yoyo/gml_Object_obj_wisp2_Step_0.gml.o] Error 2
    [armeabi-v7a] "Compile++ arm ": "yoyo <= gml_Object_obj_wisp2_Step_1.gml.cpp"
    process_begin: CreateProcess(NULL, C:/Users/kyle/android-ndk-r17/build//../toolchains/llvm/prebuilt/windows-x86_64/bin/clang++.exe -MMD -MP -MF ./obj/local/armeabi-v7a/objs/yoyo/gml_Object_obj_wisp2_Step_1.gml.o.d -gcc-toolchain C:/Users/kyle/android-ndk-r17/build//../toolchains/arm-linux-androideabi-4.9/prebuilt/windows-x86_64 -fpic -ffunction-sections -funwind-tables -fstack-protector-strong -Wno-invalid-command-line-argument -Wno-unused-command-line-argument -no-canonical-prefixes -g -target armv7-none-linux-androideabi14 -march=armv7-a -mfloat-abi=softfp -mfpu=vfpv3-d16 -fno-exceptions -fno-rtti -marm -O2 -DNDEBUG -IU://yyc/include -IC:/Users/kyle/android-ndk-r17/build//../sources/cxx-stl/llvm-libc++/include -IC:/Users/kyle/android-ndk-r17/build//../sources/cxx-stl/llvm-libc++/../llvm-libc++abi/include -IC:/Users/kyle/android-ndk-r17/build//../sources/android/support/include -Ijni/libyoyo/../.. -std=c++11 -DANDROID -c -DYYLLVM=1 -DANDROID_NDK=1 -Wno-tautological-pointer-compare -Wno-parentheses-equality -
    Wno-deprecated-writable-strings -funsigned-char -D__ANDROID_API__=14 -Wa,--noexecstack -Wformat -Werror=format-security --sysroot C:/Users/kyle/android-ndk-r17/build//../sysroot -isystem C:/Users/kyle/android-ndk-r17/build//../sysroot/usr/include/arm-linux-androideabi -c jni/libyoyo/../../gml_Object_obj_wisp2_Step_1.gml.cpp -o ./obj/local/armeabi-v7a/objs/yoyo/gml_Object_obj_wisp2_Step_1.gml.o, ...) failed.
    make (e=2): The system cannot find the file specified.
    make: *** [obj/local/armeabi-v7a/objs/yoyo/gml_Object_obj_wisp2_Step_1.gml.o] Error 2
    Stats : GMA : Elapsed=5420.1387
    Stats : GMA : sp=80,au=4,bk=0,pt=0,sc=0,sh=0,fo=0,tl=0,ob=98,ro=10,da=0,ex=3,ma=141,fm=0x200B20C28FC2820


    U://bin/GMAssetCompiler.exe exited with non-zero status (2)
    elapsed time 00:00:13.2231752s for command "C:\ProgramData\GameMakerStudio2\Cache\runtimes\runtime-2.2.1.291/bin/Igor.exe" -options="C:\Users\kyle\AppData\Local\GameMakerStudio2\GMS2TEMP\build.bff" -- Android Run started at 01/05/2019 10:35:13
    "cmd" /c subst W: /d

    elapsed time 00:00:00.1496450s for command "cmd" /c subst W: /d started at 01/05/2019 10:35:26
    "cmd" /c subst V: /d

    elapsed time 00:00:00.1471193s for command "cmd" /c subst V: /d started at 01/05/2019 10:35:26
    "cmd" /c subst U: /d

    elapsed time 00:00:00.1303547s for command "cmd" /c subst U: /d started at 01/05/2019 10:35:26
    FAILED: Run Program Complete
     

Share This Page

  1. This site uses cookies to help personalise content, tailor your experience and to keep you logged in if you register.
    By continuing to use this site, you are consenting to our use of cookies.
    Dismiss Notice