• Hello [name]! Thanks for joining the GMC. Before making any posts in the Tech Support forum, can we suggest you read the forum rules? These are simple guidelines that we ask you to follow so that you can get the best help possible for your issue.

FAILED: Package Program Complete

nebula49

Member
Still fairly new to GMS2.
I am trying to compile my game into a .zip archive. Keep getting the error "FAILED: Package Program Complete."
Can anybody help me out with this?
Entire error message below.
Code:
"cmd"  /c subst Z: "C:\Users\Isaiah\AppData\Roaming\GameMakerStudio2\Cache\GMS2CACHE"

elapsed time 00:00:00.1119304s for command "cmd" /c subst Z: "C:\Users\Isaiah\AppData\Roaming\GameMakerStudio2\Cache\GMS2CACHE" started at 02/01/2021 11:50:17
"cmd"  /c subst Y: "C:\Users\Isaiah\AppData\Local\GameMakerStudio2\GMS2TEMP"

elapsed time 00:00:00.1509059s for command "cmd" /c subst Y: "C:\Users\Isaiah\AppData\Local\GameMakerStudio2\GMS2TEMP" started at 02/01/2021 11:50:18
"cmd"  /c subst X: "C:\ProgramData\GameMakerStudio2\Cache\runtimes\runtime-2.3.0.401"

elapsed time 00:00:00.1189268s for command "cmd" /c subst X: "C:\ProgramData\GameMakerStudio2\Cache\runtimes\runtime-2.3.0.401" started at 02/01/2021 11:50:18
"C:\ProgramData/GameMakerStudio2/Cache/runtimes\runtime-2.3.0.401/bin/Igor.exe"  -j=8 -options="C:\Users\Isaiah\AppData\Local\GameMakerStudio2\GMS2TEMP\build.bff" -v -- Windows PackageZip

Loaded Macros from C:\Users\Isaiah\AppData\Roaming\GameMakerStudio2\Cache\GMS2CACHE\The_Defend_58A758D5_F6702966\macros.json
Options: X:/bin\platform_setting_defaults.json
Options: C:\Users\Isaiah\AppData\Roaming/GameMakerStudio2\isaiahsloan_2512105\local_settings.json
Options: C:\Users\Isaiah\AppData\Roaming\GameMakerStudio2\Cache\GMS2CACHE\The_Defend_58A758D5_F6702966\targetoptions.json
Setting up the Asset compiler
X://bin/GMAssetCompiler.exe  /c /mv=1 /zpex /iv=0 /rv=0 /bv=0 /j=8  /gn="The Defenders" /td="Y:/" /cd="Z:/The_Defend_58A758D5_F6702966" /zpuf="C:\Users\Isaiah\AppData\Roaming/GameMakerStudio2\isaiahsloan_2512105" /m=windows /tgt=64 /nodnd /cfg="Default" /o="Y:/The_Defenders_4E2203F4_VM" /sh=True /optionsini="Y:/The_Defenders_4E2203F4_VM\options.ini"  /cvm /baseproject="X:/BaseProject\BaseProject.yyp" "C:\Users\Isaiah\Documents\GameMakerStudio2\The Defenders\The Defenders.yyp" /preprocess="Z:/The_Defend_58A758D5_F6702966"
Found Project Format 2
Core Resources : Info - Project version is newer than supported version in CoreResources: 1.4 > 1.3
Core Resources : Info - GMAudioGroup Resource version is newer than supported version in CoreResources: 1.3 > 1.0
Core Resources : Info - GMTextureGroup Resource version is newer than supported version in CoreResources: 1.3 > 1.0
Core Resources : Info - GMWindowsOptions Resource version is newer than supported version in CoreResources: 1.1 > 1.0
ProjectFileWatcher:StartWatching:C:\Users\Isaiah\Documents\GameMakerStudio2\The Defenders
Started: 2/1/2021 11:50:19 AM
Finished: 2/1/2021 11:50:20 AM
Diff: 00:00:01.0133690
Loaded Project: The Defenders
finished.
Release build
Options: Z:/The_Defend_58A758D5_F6702966\ExtensionOptions.json
OptionsIni
Options: Z:/The_Defend_58A758D5_F6702966\PlatformOptions.json
[Compile] Run asset compiler
X://bin/GMAssetCompiler.exe  /c /mv=1 /zpex /iv=0 /rv=0 /bv=0 /j=8  /gn="The Defenders" /td="Y:/" /cd="Z:/The_Defend_58A758D5_F6702966" /zpuf="C:\Users\Isaiah\AppData\Roaming/GameMakerStudio2\isaiahsloan_2512105" /m=windows /tgt=64 /nodnd /cfg="Default" /o="Y:/The_Defenders_4E2203F4_VM" /sh=True /optionsini="Y:/The_Defenders_4E2203F4_VM\options.ini"  /cvm /baseproject="X:/BaseProject\BaseProject.yyp" "C:\Users\Isaiah\Documents\GameMakerStudio2\The Defenders\The Defenders.yyp" /bt=exe /rt=vm
Compile Constants...finished.
Remove DnD...finished.
Compile Scripts...finished.
Compile Rooms...finished.
Compile Objects...finished.
Compile Timelines...finished.
Compile Triggers...finished.
Compile Extensions...finished.
Global scripts...finished.
finished.
collapsing enums.
Final Compile...finished.
Looking for built-in particle images in C:\ProgramData\GameMakerStudio2\Cache\runtimes\runtime-2.3.0.401\bin\ParticleImages
Saving IFF file... Y:/The_Defenders_4E2203F4_VM\The Defenders.win
Writing Chunk... GEN8
option_game_speed=60
Writing Chunk... OPTN
Writing Chunk... LANG
Writing Chunk... EXTN
Writing Chunk... SOND
Writing Chunk... AGRP
Writing Chunk... SPRT
Writing Chunk... BGND
Writing Chunk... PATH
Writing Chunk... SCPT
Writing Chunk... GLOB
Writing Chunk... SHDR
Writing Chunk... FONT
Writing Chunk... TMLN
Writing Chunk... OBJT
Writing Chunk... ACRV
Writing Chunk... SEQN
Writing Chunk... TAGS
Writing Chunk... ROOM
Writing Chunk... DAFL
Writing Chunk... EMBI
Writing Chunk... TPAGE
Texture Group - Default
Writing Chunk... TGIN
Writing Chunk... CODE
Writing Chunk... VARI
Writing Chunk... FUNC
Writing Chunk... STRG
Writing Chunk... TXTR
0 Compressing texture... writing texture texture_0.png...
Writing Chunk... AUDO
Stats : GMA : Elapsed=1370.151
Stats : GMA : sp=22,au=5,bk=1,pt=0,sc=0,sh=1,fo=2,tl=0,ob=17,ro=2,da=0,ex=0,ma=26,fm=0x4000B3154CE00024
DoSteam
Igor complete.
PlatformOptions
DoVersion
DoIcon
System.IO.DirectoryNotFoundException: Could not find a part of the path 'C:\Program Files (x86)\Steam\steamapps\common\GameMaker Studio 2 Desktop\icons\icon.ico'.
   at System.IO.__Error.WinIOError(Int32 errorCode, String maybeFullPath)
   at System.IO.FileStream.Init(String path, FileMode mode, FileAccess access, Int32 rights, Boolean useRights, FileShare share, Int32 bufferSize, FileOptions options, SECURITY_ATTRIBUTES secAttrs, String msgPath, Boolean bFromProxy, Boolean useLongPath, Boolean checkHost)
   at System.IO.FileStream..ctor(String path, FileMode mode, FileAccess access, FileShare share, Int32 bufferSize, FileOptions options, String msgPath, Boolean bFromProxy, Boolean useLongPath, Boolean checkHost)
   at System.IO.File.InternalReadAllBytes(String path, Boolean checkHost)
   at Vestris.ResourceLib.IconFile.LoadFrom(String filename)
   at ..(String , String )
   at Igor.WindowsBuilder.PackageZip()
Igor complete.
elapsed time 00:00:04.7210758s for command "C:\ProgramData/GameMakerStudio2/Cache/runtimes\runtime-2.3.0.401/bin/Igor.exe" -j=8 -options="C:\Users\Isaiah\AppData\Local\GameMakerStudio2\GMS2TEMP\build.bff" -v -- Windows PackageZip started at 02/01/2021 11:50:18
"cmd"  /c subst Z: /d

elapsed time 00:00:00.0829482s for command "cmd" /c subst Z: /d started at 02/01/2021 11:50:23
"cmd"  /c subst Y: /d

elapsed time 00:00:00.1009364s for command "cmd" /c subst Y: /d started at 02/01/2021 11:50:23
"cmd"  /c subst X: /d

elapsed time 00:00:00.1049342s for command "cmd" /c subst X: /d started at 02/01/2021 11:50:23
FAILED: Package Program Complete
For the details of why this build failed, please review the whole log above and also see your Compile Errors window.
 
Top