• Hey! Guest! The 37th GMC Jam will take place between May 28th, 12:00 UTC and June 1st, 12:00 UTC. Why not join in! Click here to find out more!
  • Hello [name]! Thanks for joining the GMC. Before making any posts in the Tech Support forum, can we suggest you read the forum rules? These are simple guidelines that we ask you to follow so that you can get the best help possible for your issue.

Android / Amazon Fire Execution failed for task ':com.fireytail.slevelmaker:compileDebugJavaWithJavac'.

fireYtail

Member
Build fails on Android.

Execution failed for task ':com.fireytail.slevelmaker:compileDebugJavaWithJavac'.

What I know so far:

- Test target builds fine.
- Empty project builds fine.
- Before beta update, this project built fine. Only change made to it was adding a few sprites. Code untouched.
- Removing all extensions does nothing.
- Resetting all settings does nothing.
- Regenerating keystore does nothing.
- Adding Google Play Services and Google Play Licensing to Android SDK does nothing.
- API levels tested 28 revision 6 and 29 revision 3.
- Android SDK tools version 26.1.1
- Android NDK version 20.0.5594570 (Is this it? That was my best shot, finding that number was not easy)
- Java JDK version 1.8.0_221

I updated solely because of the AAB feature. I read there is a long complicated process to do it without beta, but this is already enough trouble going the "easy" ways because of constant building errors. Google search used to be of help, but not anymore. I know nothing, but I think this must have something to do with the beta. It seems like the empty project builds fine because it doesn't have any GML code to compile. Since the resources aren't likely to be the problem, and my Android tools can't be either since the empty project builds, this is my conclusion. I would appreciate help.
 

fireYtail

Member
Post the full compiler log.
Code:
Saving project to: C:\Users\Adrián\Documents\GameMakerStudio2\fireYtail's Level Maker Full\fireYtail's Level Maker Full.yyp
"cmd"  /c subst Z: "C:\Users\Adrián\AppData\Roaming\GameMakerStudio2\Cache\GMS2CACHE"

elapsed time 00:00:00.0570017s for command "cmd" /c subst Z: "C:\Users\Adrián\AppData\Roaming\GameMakerStudio2\Cache\GMS2CACHE" started at 09/29/2019 23:16:22
"cmd"  /c subst Y: "C:\Users\Adrián\AppData\Local\GameMakerStudio2\GMS2TEMP"

elapsed time 00:00:00.0370022s for command "cmd" /c subst Y: "C:\Users\Adrián\AppData\Local\GameMakerStudio2\GMS2TEMP" started at 09/29/2019 23:16:22
"cmd"  /c subst X: "C:\ProgramData\GameMakerStudio2\Cache\runtimes\runtime-2.2.4.357"

elapsed time 00:00:00.0359985s for command "cmd" /c subst X: "C:\ProgramData\GameMakerStudio2\Cache\runtimes\runtime-2.2.4.357" started at 09/29/2019 23:16:22
"C:\ProgramData/GameMakerStudio2/Cache/runtimes\runtime-2.2.4.357/bin/Igor.exe"  -j=8 -options="C:\Users\Adrián\AppData\Local\GameMakerStudio2\GMS2TEMP\build.bff" -v -- Android Package

Loaded Macros from C:\Users\Adrián\AppData\Roaming\GameMakerStudio2\Cache\GMS2CACHE\fireYtail'_E1C5BC4_B82327DA\macros.json
Options: X:/bin\platform_setting_defaults.json
Options: C:\Users\Adrián\AppData\Roaming/GameMakerStudio2\AdrianBenitezCoca_2154408\local_settings.json
Options: C:\Users\Adrián\AppData\Roaming\GameMakerStudio2\Cache\GMS2CACHE\fireYtail'_E1C5BC4_B82327DA\targetoptions.json
X://bin/GMAssetCompiler.exe  /c /zpex /iv=0 /rv=0 /bv=0 /j=8  /gn="fireYtail's Level Maker Full" /td="Y:/" /cd="Z:/fireYtail'_E1C5BC4_B82327DA" /zpuf="C:\Users\Adrián\AppData\Roaming/GameMakerStudio2\AdrianBenitezCoca_2154408" /m=llvm-android /tgt=8 /llvmSource="X://yyc/"  /nodnd /cfg="default" /fU="Z:/fireYtail'_E1C5BC4_B82327DA\functionsUsed.txt" /o="Y:/fireYtail's_Level_Maker_Full_3704E967_YYC" /optionsini="Y:/fireYtail's_Level_Maker_Full_3704E967_YYC\options.ini" /baseproject="X:/BaseProject\BaseProject.yyp" "C:\Users\Adrián\Documents\GameMakerStudio2\fireYtail's Level Maker Full\fireYtail's Level Maker Full.yyp" /preprocess="Z:/fireYtail'_E1C5BC4_B82327DA"
Reading project file....C:\Users\Adrián\Documents\GameMakerStudio2\fireYtail's Level Maker Full
Reading project file....X:\BaseProject
Reading config delta 'C:\Users\Adrián\Documents\GameMakerStudio2\fireYtail's Level Maker Full\options\main\inherited\options_main.inherited.yy'
finished.


X://bin/GMAssetCompiler.exe DONE (0)
Release build
Options: Z:/fireYtail'_E1C5BC4_B82327DA\ExtensionOptions.json
PlatformOptions
Options: Z:/fireYtail'_E1C5BC4_B82327DA\PlatformOptions.json
Options: Z:/fireYtail'_E1C5BC4_B82327DA\MainOptions.json
displayname
hostname
runtime
C:\Android_SDK\platform-tools\adb connect "emulator-5554"
cannot resolve host 'emulator-5554' and port 5555: Host desconocido. (11001)


C:\Android_SDK\platform-tools\adb DONE (0)
C:\Android_SDK\platform-tools\adb devices
List of devices attached



C:\Android_SDK\platform-tools\adb DONE (0)
OptionsIni
PlatformOptions
X://bin/GMAssetCompiler.exe  /c /zpex /iv=0 /rv=0 /bv=0 /j=8  /gn="fireYtail's Level Maker Full" /td="Y:/" /cd="Z:/fireYtail'_E1C5BC4_B82327DA" /zpuf="C:\Users\Adrián\AppData\Roaming/GameMakerStudio2\AdrianBenitezCoca_2154408" /m=llvm-android /tgt=8 /llvmSource="X://yyc/"  /nodnd /cfg="default" /fU="Z:/fireYtail'_E1C5BC4_B82327DA\functionsUsed.txt" /o="Y:/fireYtail's_Level_Maker_Full_3704E967_YYC" /optionsini="Y:/fireYtail's_Level_Maker_Full_3704E967_YYC\options.ini" /baseproject="X:/BaseProject\BaseProject.yyp" "C:\Users\Adrián\Documents\GameMakerStudio2\fireYtail's Level Maker Full\fireYtail's Level Maker Full.yyp" /arch=54 /bt=exe /rt=yyc
Reading project file....C:\Users\Adrián\Documents\GameMakerStudio2\fireYtail's Level Maker Full
Reading project file....X:\BaseProject
Reading config delta 'C:\Users\Adrián\Documents\GameMakerStudio2\fireYtail's Level Maker Full\options\main\inherited\options_main.inherited.yy'
finished.
Compile Constants...finished.
Remove DnD...finished.
Compile Scripts...finished.
Compile Objects...finished.
Compile Timelines...finished.
Compile Triggers...finished.
Compile Rooms...finished.
Compile Extensions...finished.
Global scripts...finished.
finished.
collapsing enums.
Final Compile...finished.
Writing Chunk... GEN8
option_game_speed=60
Writing Chunk... OPTN
Writing Chunk... LANG
Writing Chunk... EXTN
Writing Chunk... SOND
Writing Chunk... AGRP
Writing Chunk... SPRT
Writing Chunk... BGND
Writing Chunk... PATH
Writing Chunk... SCPT
Writing Chunk... GLOB
Writing Chunk... SHDR
Writing Chunk... FONT
Writing Chunk... TMLN
Writing Chunk... OBJT
Writing Chunk... ROOM
Writing Chunk... DAFL
Writing Chunk... EMBI
Writing Chunk... TPAGE
Texture Group - Default
Writing Chunk... TGIN
Writing Chunk... STRG
Writing Chunk... TXTR
0 Compressing texture... writing texture texture_0.png...
1 Compressing texture... writing texture texture_1.png...
2 Compressing texture... writing texture texture_2.png...
3 Compressing texture... writing texture texture_3.png...
4 Compressing texture... writing texture texture_4.png...
5 Compressing texture... writing texture texture_5.png...
6 Compressing texture... writing texture texture_6.png...
7 Compressing texture... writing texture texture_7.png...
8 Compressing texture... writing texture texture_8.png...
9 Compressing texture... writing texture texture_9.png...
10 Compressing texture... writing texture texture_10.png...
11 Compressing texture... writing texture texture_11.png...
12 Compressing texture... writing texture texture_12.png...
13 Compressing texture... writing texture texture_13.png...
14 Compressing texture... writing texture texture_14.png...
15 Compressing texture... writing texture texture_15.png...
16 Compressing texture... writing texture texture_16.png...
17 Compressing texture... writing texture texture_17.png...
18 Compressing texture... writing texture texture_18.png...
19 Compressing texture... writing texture texture_19.png...
Writing Chunk... AUDO
ClangExeLocation=C:\Android_NDK\toolchains\llvm\prebuilt\windows-x86_64\bin\clang++.exe
Using NDKDir = C:\Android_NDK
Using PlatformDir = C:\Android_NDK\platforms\android-29
Using ARMToolChain = C:\Android_NDK\toolchains\arm-linux-androideabi-4.9\prebuilt\windows-x86_64
Using X86ToolChain = C:\Android_NDK\toolchains\x86-4.9\prebuilt\windows-x86_64
Using ARM64ToolChain = C:\Android_NDK\toolchains\aarch64-linux-android-4.9\prebuilt\windows-x86_64
Using X86_64ToolChain = C:\Android_NDK\toolchains\x86_64-4.9\prebuilt\windows-x86_64
saving file Y:/fireYtail's_Level_Maker_Full_3704E967_YYC\fireYtail's Level Maker Full.droid
Android NDK: android-14 is unsupported. Using minimum supported version android-16.
Android NDK: WARNING: APP_PLATFORM android-16 is higher than android:minSdkVersion 14 in ./AndroidManifest.xml. NDK binaries will *not* be compatible with devices older than android-16. See https://android.googlesource.com/platform/ndk/+/master/docs/user/common_problems.md for more information.
[armeabi-v7a] Compile++ arm  : yoyo <= fireYtail_s_Level_Maker_Full.vars.cpp
[x86] Compile++      : yoyo <= fireYtail_s_Level_Maker_Full.vars.cpp
[arm64-v8a] Compile++      : yoyo <= fireYtail_s_Level_Maker_Full.vars.cpp
[x86_64] Compile++      : yoyo <= fireYtail_s_Level_Maker_Full.vars.cpp
[armeabi-v7a] Install        : libc++_shared.so => Y:/fireYtail's_Level_Maker_Full_3704E967_YYC/lib/armeabi-v7a/libc++_shared.so
[x86] Install        : libc++_shared.so => Y:/fireYtail's_Level_Maker_Full_3704E967_YYC/lib/x86/libc++_shared.so
[arm64-v8a] Install        : libc++_shared.so => Y:/fireYtail's_Level_Maker_Full_3704E967_YYC/lib/arm64-v8a/libc++_shared.so
[x86_64] Install        : libc++_shared.so => Y:/fireYtail's_Level_Maker_Full_3704E967_YYC/lib/x86_64/libc++_shared.so
[x86] SharedLibrary  : libyoyo.so
[armeabi-v7a] SharedLibrary  : libyoyo.so
[arm64-v8a] SharedLibrary  : libyoyo.so
[x86_64] SharedLibrary  : libyoyo.so
[x86] Install        : libyoyo.so => Y:/fireYtail's_Level_Maker_Full_3704E967_YYC/lib/x86/libyoyo.so
[x86_64] Install        : libyoyo.so => Y:/fireYtail's_Level_Maker_Full_3704E967_YYC/lib/x86_64/libyoyo.so
[armeabi-v7a] Install        : libyoyo.so => Y:/fireYtail's_Level_Maker_Full_3704E967_YYC/lib/armeabi-v7a/libyoyo.so
[arm64-v8a] Install        : libyoyo.so => Y:/fireYtail's_Level_Maker_Full_3704E967_YYC/lib/arm64-v8a/libyoyo.so
Stats : GMA : Elapsed=6778,9971
Stats : GMA : sp=241,au=7,bk=0,pt=0,sc=29,sh=0,fo=3,tl=0,ob=15,ro=1,da=1,ex=3,ma=2,fm=0x80B20008A00A24


X://bin/GMAssetCompiler.exe DONE (0)
AndroidEnvironment
Manifest Permissions
Manifest Metadata
Check GML functions
Licensing
8
Copying C:\Users\Adrián\Documents\GameMakerStudio2\fireYtail's Level Maker Full\extensions\GooglePlayServicesIAPExtension\AndroidSource\java\RunnerBilling.java to Z:/fireYtail'_E1C5BC4_B82327DA\Android\default\com.fireytail.slevelmaker\src\main\java\com\fireytail\slevelmaker\RunnerBilling.java...
Copying C:\Users\Adrián\Documents\GameMakerStudio2\fireYtail's Level Maker Full\extensions\GooglePlayServicesIAPExtension\AndroidSource\java\RunnerBillingSecurity.java to Z:/fireYtail'_E1C5BC4_B82327DA\Android\default\com.fireytail.slevelmaker\src\main\java\com\fireytail\slevelmaker\RunnerBillingSecurity.java...
Copying C:\Users\Adrián\Documents\GameMakerStudio2\fireYtail's Level Maker Full\extensions\GooglePlayServicesIAPExtension\AndroidSource\java\RunnerBillingService.java to Z:/fireYtail'_E1C5BC4_B82327DA\Android\default\com.fireytail.slevelmaker\src\main\java\com\fireytail\slevelmaker\RunnerBillingService.java...
Copying C:\Users\Adrián\Documents\GameMakerStudio2\fireYtail's Level Maker Full\extensions\GooglePlayServicesIAPExtension\AndroidSource\java\BillingRequests\BillingRequest.java to Z:/fireYtail'_E1C5BC4_B82327DA\Android\default\com.fireytail.slevelmaker\src\main\java\com\fireytail\slevelmaker\BillingRequests\BillingRequest.java...
Copying C:\Users\Adrián\Documents\GameMakerStudio2\fireYtail's Level Maker Full\extensions\GooglePlayServicesIAPExtension\AndroidSource\java\BillingRequests\GetPurchases.java to Z:/fireYtail'_E1C5BC4_B82327DA\Android\default\com.fireytail.slevelmaker\src\main\java\com\fireytail\slevelmaker\BillingRequests\GetPurchases.java...
Copying C:\Users\Adrián\Documents\GameMakerStudio2\fireYtail's Level Maker Full\extensions\GooglePlayServicesIAPExtension\AndroidSource\java\BillingRequests\GetSkuDetails.java to Z:/fireYtail'_E1C5BC4_B82327DA\Android\default\com.fireytail.slevelmaker\src\main\java\com\fireytail\slevelmaker\BillingRequests\GetSkuDetails.java...
Copying C:\Users\Adrián\Documents\GameMakerStudio2\fireYtail's Level Maker Full\extensions\GooglePlayServicesIAPExtension\AndroidSource\java\BillingRequests\RequestConsume.java to Z:/fireYtail'_E1C5BC4_B82327DA\Android\default\com.fireytail.slevelmaker\src\main\java\com\fireytail\slevelmaker\BillingRequests\RequestConsume.java...
Copying C:\Users\Adrián\Documents\GameMakerStudio2\fireYtail's Level Maker Full\extensions\GooglePlayServicesIAPExtension\AndroidSource\java\BillingRequests\RequestPurchase.java to Z:/fireYtail'_E1C5BC4_B82327DA\Android\default\com.fireytail.slevelmaker\src\main\java\com\fireytail\slevelmaker\BillingRequests\RequestPurchase.java...
1
Copying C:\Users\Adrián\Documents\GameMakerStudio2\fireYtail's Level Maker Full\extensions\GooglePlayLicensingAsExt\AndroidSource\java\GooglePlayLicensingAsExt.java to Z:/fireYtail'_E1C5BC4_B82327DA\Android\default\com.fireytail.slevelmaker\src\main\java\com\fireytail\slevelmaker\GooglePlayLicensingAsExt.java...
1
Copying X:/Android\runner\ExtensionFiles\build.gradle to Z:/fireYtail'_E1C5BC4_B82327DA\Android\default\allib\build.gradle...
3
Copying C:\Users\Adrián\Documents\GameMakerStudio2\fireYtail's Level Maker Full\extensions\GooglePlayServicesExtension\AndroidSource\java\BaseGameUtils.java to Z:/fireYtail'_E1C5BC4_B82327DA\Android\default\com.fireytail.slevelmaker\src\main\java\com\fireytail\slevelmaker\BaseGameUtils.java...
Copying C:\Users\Adrián\Documents\GameMakerStudio2\fireYtail's Level Maker Full\extensions\GooglePlayServicesExtension\AndroidSource\java\GooglePlayServicesExtension.java to Z:/fireYtail'_E1C5BC4_B82327DA\Android\default\com.fireytail.slevelmaker\src\main\java\com\fireytail\slevelmaker\GooglePlayServicesExtension.java...
Copying C:\Users\Adrián\Documents\GameMakerStudio2\fireYtail's Level Maker Full\extensions\GooglePlayServicesExtension\AndroidSource\java\RunnerBillingInterface.java to Z:/fireYtail'_E1C5BC4_B82327DA\Android\default\com.fireytail.slevelmaker\src\main\java\com\fireytail\slevelmaker\RunnerBillingInterface.java...
1
Copying C:\Users\Adrián\Documents\GameMakerStudio2\fireYtail's Level Maker Full\extensions\GooglePlayServicesExtension\AndroidSource\res\values\gps_strings.xml to Z:/fireYtail'_E1C5BC4_B82327DA\Android\default\com.fireytail.slevelmaker\src\main\res\values\gps_strings.xml...
3
Copying X:/Android\runner\RootFiles\build.gradle to Z:/fireYtail'_E1C5BC4_B82327DA\Android\default\build.gradle...
Copying X:/Android\runner\RootFiles\gradle.properties to Z:/fireYtail'_E1C5BC4_B82327DA\Android\default\gradle.properties...
Copying X:/Android\runner\RootFiles\settings.gradle to Z:/fireYtail'_E1C5BC4_B82327DA\Android\default\settings.gradle...
59
Copying X:/Android\runner\ProjectFiles\build.gradle to Z:/fireYtail'_E1C5BC4_B82327DA\Android\default\com.fireytail.slevelmaker\build.gradle...
Copying X:/Android\runner\ProjectFiles\lint.xml to Z:/fireYtail'_E1C5BC4_B82327DA\Android\default\com.fireytail.slevelmaker\lint.xml...
Copying X:/Android\runner\ProjectFiles\libs\ini4j-0.5.2.jar to Z:/fireYtail'_E1C5BC4_B82327DA\Android\default\com.fireytail.slevelmaker\libs\ini4j-0.5.2.jar...
Copying X:/Android\runner\ProjectFiles\libs\org.apache.http.legacy.jar to Z:/fireYtail'_E1C5BC4_B82327DA\Android\default\com.fireytail.slevelmaker\libs\org.apache.http.legacy.jar...
Copying X:/Android\runner\ProjectFiles\src\main\AndroidManifest.xml to Z:/fireYtail'_E1C5BC4_B82327DA\Android\default\com.fireytail.slevelmaker\src\main\AndroidManifest.xml...
Copying X:/Android\runner\ProjectFiles\src\main\assets\splash.png to Z:/fireYtail'_E1C5BC4_B82327DA\Android\default\com.fireytail.slevelmaker\src\main\assets\splash.png...
Copying X:/Android\runner\ProjectFiles\src\main\java\com\yoyogames\runner\RunnerJNILib.java to Z:/fireYtail'_E1C5BC4_B82327DA\Android\default\com.fireytail.slevelmaker\src\main\java\com\yoyogames\runner\RunnerJNILib.java...
Copying X:/Android\runner\ProjectFiles\src\main\java\YYAndroidPackageDomain\YYAndroidPackageCompany\YYAndroidPackageProduct\AdvertisingBase.java to Z:/fireYtail'_E1C5BC4_B82327DA\Android\default\com.fireytail.slevelmaker\src\main\java\com\fireytail\slevelmaker\AdvertisingBase.java...
Copying X:/Android\runner\ProjectFiles\src\main\java\YYAndroidPackageDomain\YYAndroidPackageCompany\YYAndroidPackageProduct\DemoGLSurfaceView.java to Z:/fireYtail'_E1C5BC4_B82327DA\Android\default\com.fireytail.slevelmaker\src\main\java\com\fireytail\slevelmaker\DemoGLSurfaceView.java...
Copying X:/Android\runner\ProjectFiles\src\main\java\YYAndroidPackageDomain\YYAndroidPackageCompany\YYAndroidPackageProduct\DemoRenderer.java to Z:/fireYtail'_E1C5BC4_B82327DA\Android\default\com.fireytail.slevelmaker\src\main\java\com\fireytail\slevelmaker\DemoRenderer.java...
Copying X:/Android\runner\ProjectFiles\src\main\java\YYAndroidPackageDomain\YYAndroidPackageCompany\YYAndroidPackageProduct\DemoRendererGL2.java to Z:/fireYtail'_E1C5BC4_B82327DA\Android\default\com.fireytail.slevelmaker\src\main\java\com\fireytail\slevelmaker\DemoRendererGL2.java...
Copying X:/Android\runner\ProjectFiles\src\main\java\YYAndroidPackageDomain\YYAndroidPackageCompany\YYAndroidPackageProduct\ExtensionBase.java to Z:/fireYtail'_E1C5BC4_B82327DA\Android\default\com.fireytail.slevelmaker\src\main\java\com\fireytail\slevelmaker\ExtensionBase.java...
Copying X:/Android\runner\ProjectFiles\src\main\java\YYAndroidPackageDomain\YYAndroidPackageCompany\YYAndroidPackageProduct\IAdExt.java to Z:/fireYtail'_E1C5BC4_B82327DA\Android\default\com.fireytail.slevelmaker\src\main\java\com\fireytail\slevelmaker\IAdExt.java...
Copying X:/Android\runner\ProjectFiles\src\main\java\YYAndroidPackageDomain\YYAndroidPackageCompany\YYAndroidPackageProduct\IAdvertising.java to Z:/fireYtail'_E1C5BC4_B82327DA\Android\default\com.fireytail.slevelmaker\src\main\java\com\fireytail\slevelmaker\IAdvertising.java...
Copying X:/Android\runner\ProjectFiles\src\main\java\YYAndroidPackageDomain\YYAndroidPackageCompany\YYAndroidPackageProduct\IExtensionBase.java to Z:/fireYtail'_E1C5BC4_B82327DA\Android\default\com.fireytail.slevelmaker\src\main\java\com\fireytail\slevelmaker\IExtensionBase.java...
Copying X:/Android\runner\ProjectFiles\src\main\java\YYAndroidPackageDomain\YYAndroidPackageCompany\YYAndroidPackageProduct\IniBundle.java to Z:/fireYtail'_E1C5BC4_B82327DA\Android\default\com.fireytail.slevelmaker\src\main\java\com\fireytail\slevelmaker\IniBundle.java...
Copying X:/Android\runner\ProjectFiles\src\main\java\YYAndroidPackageDomain\YYAndroidPackageCompany\YYAndroidPackageProduct\ISocial.java to Z:/fireYtail'_E1C5BC4_B82327DA\Android\default\com.fireytail.slevelmaker\src\main\java\com\fireytail\slevelmaker\ISocial.java...
Copying X:/Android\runner\ProjectFiles\src\main\java\YYAndroidPackageDomain\YYAndroidPackageCompany\YYAndroidPackageProduct\RunnerActivity.java to Z:/fireYtail'_E1C5BC4_B82327DA\Android\default\com.fireytail.slevelmaker\src\main\java\com\fireytail\slevelmaker\RunnerActivity.java...
Copying X:/Android\runner\ProjectFiles\src\main\java\YYAndroidPackageDomain\YYAndroidPackageCompany\YYAndroidPackageProduct\RunnerAdExt.java to Z:/fireYtail'_E1C5BC4_B82327DA\Android\default\com.fireytail.slevelmaker\src\main\java\com\fireytail\slevelmaker\RunnerAdExt.java...
Copying X:/Android\runner\ProjectFiles\src\main\java\YYAndroidPackageDomain\YYAndroidPackageCompany\YYAndroidPackageProduct\RunnerApplication.java to Z:/fireYtail'_E1C5BC4_B82327DA\Android\default\com.fireytail.slevelmaker\src\main\java\com\fireytail\slevelmaker\RunnerApplication.java...
Copying X:/Android\runner\ProjectFiles\src\main\java\YYAndroidPackageDomain\YYAndroidPackageCompany\YYAndroidPackageProduct\RunnerKeyboardController.java to Z:/fireYtail'_E1C5BC4_B82327DA\Android\default\com.fireytail.slevelmaker\src\main\java\com\fireytail\slevelmaker\RunnerKeyboardController.java...
Copying X:/Android\runner\ProjectFiles\src\main\java\YYAndroidPackageDomain\YYAndroidPackageCompany\YYAndroidPackageProduct\RunnerSocial.java to Z:/fireYtail'_E1C5BC4_B82327DA\Android\default\com.fireytail.slevelmaker\src\main\java\com\fireytail\slevelmaker\RunnerSocial.java...
Copying X:/Android\runner\ProjectFiles\src\main\java\YYAndroidPackageDomain\YYAndroidPackageCompany\YYAndroidPackageProduct\RunnerVsyncHandler.java to Z:/fireYtail'_E1C5BC4_B82327DA\Android\default\com.fireytail.slevelmaker\src\main\java\com\fireytail\slevelmaker\RunnerVsyncHandler.java...
Copying X:/Android\runner\ProjectFiles\src\main\java\YYAndroidPackageDomain\YYAndroidPackageCompany\YYAndroidPackageProduct\Gamepad\Gamepad.java to Z:/fireYtail'_E1C5BC4_B82327DA\Android\default\com.fireytail.slevelmaker\src\main\java\com\fireytail\slevelmaker\Gamepad\Gamepad.java...
Copying X:/Android\runner\ProjectFiles\src\main\java\YYAndroidPackageDomain\YYAndroidPackageCompany\YYAndroidPackageProduct\Purchases\IRunnerBilling.java to Z:/fireYtail'_E1C5BC4_B82327DA\Android\default\com.fireytail.slevelmaker\src\main\java\com\fireytail\slevelmaker\Purchases\IRunnerBilling.java...
Copying X:/Android\runner\ProjectFiles\src\main\java\YYAndroidPackageDomain\YYAndroidPackageCompany\YYAndroidPackageProduct\Purchases\Null\NullBilling.java to Z:/fireYtail'_E1C5BC4_B82327DA\Android\default\com.fireytail.slevelmaker\src\main\java\com\fireytail\slevelmaker\Purchases\Null\NullBilling.java...
Copying X:/Android\runner\ProjectFiles\src\main\jniLibs\arm64-v8a\libc++_shared.so to Z:/fireYtail'_E1C5BC4_B82327DA\Android\default\com.fireytail.slevelmaker\src\main\jniLibs\arm64-v8a\libc++_shared.so...
Copying X:/Android\runner\ProjectFiles\src\main\jniLibs\arm64-v8a\libyoyo.so to Z:/fireYtail'_E1C5BC4_B82327DA\Android\default\com.fireytail.slevelmaker\src\main\jniLibs\arm64-v8a\libyoyo.so...
Copying X:/Android\runner\ProjectFiles\src\main\jniLibs\armeabi\libyoyo.so to Z:/fireYtail'_E1C5BC4_B82327DA\Android\default\com.fireytail.slevelmaker\src\main\jniLibs\armeabi\libyoyo.so...
Copying X:/Android\runner\ProjectFiles\src\main\jniLibs\armeabi-v7a\libc++_shared.so to Z:/fireYtail'_E1C5BC4_B82327DA\Android\default\com.fireytail.slevelmaker\src\main\jniLibs\armeabi-v7a\libc++_shared.so...
Copying X:/Android\runner\ProjectFiles\src\main\jniLibs\armeabi-v7a\libyoyo.so to Z:/fireYtail'_E1C5BC4_B82327DA\Android\default\com.fireytail.slevelmaker\src\main\jniLibs\armeabi-v7a\libyoyo.so...
Copying X:/Android\runner\ProjectFiles\src\main\jniLibs\mips\libyoyo.so to Z:/fireYtail'_E1C5BC4_B82327DA\Android\default\com.fireytail.slevelmaker\src\main\jniLibs\mips\libyoyo.so...
Copying X:/Android\runner\ProjectFiles\src\main\jniLibs\mips64\libyoyo.so to Z:/fireYtail'_E1C5BC4_B82327DA\Android\default\com.fireytail.slevelmaker\src\main\jniLibs\mips64\libyoyo.so...
Copying X:/Android\runner\ProjectFiles\src\main\jniLibs\x86\libc++_shared.so to Z:/fireYtail'_E1C5BC4_B82327DA\Android\default\com.fireytail.slevelmaker\src\main\jniLibs\x86\libc++_shared.so...
Copying X:/Android\runner\ProjectFiles\src\main\jniLibs\x86\libyoyo.so to Z:/fireYtail'_E1C5BC4_B82327DA\Android\default\com.fireytail.slevelmaker\src\main\jniLibs\x86\libyoyo.so...
Copying X:/Android\runner\ProjectFiles\src\main\jniLibs\x86_64\libc++_shared.so to Z:/fireYtail'_E1C5BC4_B82327DA\Android\default\com.fireytail.slevelmaker\src\main\jniLibs\x86_64\libc++_shared.so...
Copying X:/Android\runner\ProjectFiles\src\main\jniLibs\x86_64\libyoyo.so to Z:/fireYtail'_E1C5BC4_B82327DA\Android\default\com.fireytail.slevelmaker\src\main\jniLibs\x86_64\libyoyo.so...
Copying X:/Android\runner\ProjectFiles\src\main\res\drawable-hdpi\icon.png to Z:/fireYtail'_E1C5BC4_B82327DA\Android\default\com.fireytail.slevelmaker\src\main\res\drawable-hdpi\icon.png...
Copying X:/Android\runner\ProjectFiles\src\main\res\drawable-hdpi-v26\adaptive_bg.png to Z:/fireYtail'_E1C5BC4_B82327DA\Android\default\com.fireytail.slevelmaker\src\main\res\drawable-hdpi-v26\adaptive_bg.png...
Copying X:/Android\runner\ProjectFiles\src\main\res\drawable-hdpi-v26\adaptive_icon.png to Z:/fireYtail'_E1C5BC4_B82327DA\Android\default\com.fireytail.slevelmaker\src\main\res\drawable-hdpi-v26\adaptive_icon.png...
Copying X:/Android\runner\ProjectFiles\src\main\res\drawable-hdpi-v26\icon.xml to Z:/fireYtail'_E1C5BC4_B82327DA\Android\default\com.fireytail.slevelmaker\src\main\res\drawable-hdpi-v26\icon.xml...
Copying X:/Android\runner\ProjectFiles\src\main\res\drawable-ldpi-v26\adaptive_bg.png to Z:/fireYtail'_E1C5BC4_B82327DA\Android\default\com.fireytail.slevelmaker\src\main\res\drawable-ldpi-v26\adaptive_bg.png...
Copying X:/Android\runner\ProjectFiles\src\main\res\drawable-ldpi-v26\adaptive_icon.png to Z:/fireYtail'_E1C5BC4_B82327DA\Android\default\com.fireytail.slevelmaker\src\main\res\drawable-ldpi-v26\adaptive_icon.png...
Copying X:/Android\runner\ProjectFiles\src\main\res\drawable-ldpi-v26\icon.xml to Z:/fireYtail'_E1C5BC4_B82327DA\Android\default\com.fireytail.slevelmaker\src\main\res\drawable-ldpi-v26\icon.xml...
Copying X:/Android\runner\ProjectFiles\src\main\res\drawable-mdpi-v26\adaptive_bg.png to Z:/fireYtail'_E1C5BC4_B82327DA\Android\default\com.fireytail.slevelmaker\src\main\res\drawable-mdpi-v26\adaptive_bg.png...
Copying X:/Android\runner\ProjectFiles\src\main\res\drawable-mdpi-v26\adaptive_icon.png to Z:/fireYtail'_E1C5BC4_B82327DA\Android\default\com.fireytail.slevelmaker\src\main\res\drawable-mdpi-v26\adaptive_icon.png...
Copying X:/Android\runner\ProjectFiles\src\main\res\drawable-mdpi-v26\icon.xml to Z:/fireYtail'_E1C5BC4_B82327DA\Android\default\com.fireytail.slevelmaker\src\main\res\drawable-mdpi-v26\icon.xml...
Copying X:/Android\runner\ProjectFiles\src\main\res\drawable-xhdpi-v26\adaptive_bg.png to Z:/fireYtail'_E1C5BC4_B82327DA\Android\default\com.fireytail.slevelmaker\src\main\res\drawable-xhdpi-v26\adaptive_bg.png...
Copying X:/Android\runner\ProjectFiles\src\main\res\drawable-xhdpi-v26\adaptive_icon.png to Z:/fireYtail'_E1C5BC4_B82327DA\Android\default\com.fireytail.slevelmaker\src\main\res\drawable-xhdpi-v26\adaptive_icon.png...
Copying X:/Android\runner\ProjectFiles\src\main\res\drawable-xhdpi-v26\icon.xml to Z:/fireYtail'_E1C5BC4_B82327DA\Android\default\com.fireytail.slevelmaker\src\main\res\drawable-xhdpi-v26\icon.xml...
Copying X:/Android\runner\ProjectFiles\src\main\res\drawable-xxhdpi-v26\adaptive_bg.png to Z:/fireYtail'_E1C5BC4_B82327DA\Android\default\com.fireytail.slevelmaker\src\main\res\drawable-xxhdpi-v26\adaptive_bg.png...
Copying X:/Android\runner\ProjectFiles\src\main\res\drawable-xxhdpi-v26\adaptive_icon.png to Z:/fireYtail'_E1C5BC4_B82327DA\Android\default\com.fireytail.slevelmaker\src\main\res\drawable-xxhdpi-v26\adaptive_icon.png...
Copying X:/Android\runner\ProjectFiles\src\main\res\drawable-xxhdpi-v26\icon.xml to Z:/fireYtail'_E1C5BC4_B82327DA\Android\default\com.fireytail.slevelmaker\src\main\res\drawable-xxhdpi-v26\icon.xml...
Copying X:/Android\runner\ProjectFiles\src\main\res\drawable-xxxhdpi-v26\adaptive_bg.png to Z:/fireYtail'_E1C5BC4_B82327DA\Android\default\com.fireytail.slevelmaker\src\main\res\drawable-xxxhdpi-v26\adaptive_bg.png...
Copying X:/Android\runner\ProjectFiles\src\main\res\drawable-xxxhdpi-v26\adaptive_icon.png to Z:/fireYtail'_E1C5BC4_B82327DA\Android\default\com.fireytail.slevelmaker\src\main\res\drawable-xxxhdpi-v26\adaptive_icon.png...
Copying X:/Android\runner\ProjectFiles\src\main\res\drawable-xxxhdpi-v26\icon.xml to Z:/fireYtail'_E1C5BC4_B82327DA\Android\default\com.fireytail.slevelmaker\src\main\res\drawable-xxxhdpi-v26\icon.xml...
Copying X:/Android\runner\ProjectFiles\src\main\res\layout\main.xml to Z:/fireYtail'_E1C5BC4_B82327DA\Android\default\com.fireytail.slevelmaker\src\main\res\layout\main.xml...
Copying X:/Android\runner\ProjectFiles\src\main\res\layout\userpasslayout.xml to Z:/fireYtail'_E1C5BC4_B82327DA\Android\default\com.fireytail.slevelmaker\src\main\res\layout\userpasslayout.xml...
Copying X:/Android\runner\ProjectFiles\src\main\res\values\strings.xml to Z:/fireYtail'_E1C5BC4_B82327DA\Android\default\com.fireytail.slevelmaker\src\main\res\values\strings.xml...
DoSplash
DoIcon
C:\windows\system32\cmd.exe /c "subst W: "Z:/fireYtail'_E1C5BC4_B82327DA\Android\default" && W: && cd "com.fireytail.slevelmaker" && "X:/Android\runner\gradle\gradlew" build  bundleRelease  -x lint  "
Starting a Gradle Daemon, 1 incompatible and 1 stopped Daemons could not be reused, use --status for details

> Configure project :allib
WARNING: Configuration 'compile' is obsolete and has been replaced with 'implementation' and 'api'.
It will be removed at the end of 2018. For more information see: http://d.android.com/r/tools/update-dependency-configurations.html

> Configure project :com.fireytail.slevelmaker
WARNING: Configuration 'compile' is obsolete and has been replaced with 'implementation' and 'api'.
It will be removed at the end of 2018. For more information see: http://d.android.com/r/tools/update-dependency-configurations.html

> Task :allib:preBuild UP-TO-DATE
> Task :allib:preDebugBuild UP-TO-DATE
> Task :allib:compileDebugAidl NO-SOURCE
> Task :allib:compileDebugRenderscript
> Task :allib:checkDebugManifest
> Task :allib:generateDebugBuildConfig
> Task :allib:generateDebugResValues
> Task :allib:generateDebugResources
> Task :allib:packageDebugResources
> Task :allib:processDebugManifest
> Task :allib:generateDebugRFile
> Task :allib:prepareLintJar UP-TO-DATE
> Task :allib:generateDebugSources
> Task :allib:javaPreCompileDebug

> Task :allib:compileDebugJavaWithJavac
Note: W:\allib\src\com\google\android\vending\licensing\LicenseChecker.java uses or overrides a deprecated API.
Note: Recompile with -Xlint:deprecation for details.

> Task :allib:bundleLibCompileDebug
> Task :com.fireytail.slevelmaker:preBuild UP-TO-DATE
> Task :com.fireytail.slevelmaker:preDebugBuild
> Task :com.fireytail.slevelmaker:compileDebugAidl NO-SOURCE
> Task :allib:packageDebugRenderscript NO-SOURCE
> Task :com.fireytail.slevelmaker:compileDebugRenderscript NO-SOURCE
> Task :com.fireytail.slevelmaker:checkDebugManifest
> Task :com.fireytail.slevelmaker:generateDebugBuildConfig
> Task :com.fireytail.slevelmaker:prepareLintJar UP-TO-DATE
> Task :com.fireytail.slevelmaker:generateDebugSources
> Task :com.fireytail.slevelmaker:javaPreCompileDebug
> Task :com.fireytail.slevelmaker:mainApkListPersistenceDebug
> Task :com.fireytail.slevelmaker:generateDebugResValues
> Task :com.fireytail.slevelmaker:generateDebugResources
> Task :com.fireytail.slevelmaker:mergeDebugResources
> Task :com.fireytail.slevelmaker:createDebugCompatibleScreenManifests

> Task :com.fireytail.slevelmaker:processDebugManifest
W:\com.fireytail.slevelmaker\src\main\AndroidManifest.xml:30:3-84:17 Warning:
    application@android:label was tagged at AndroidManifest.xml:30 to replace other declarations but no other declaration present
W:\com.fireytail.slevelmaker\src\main\AndroidManifest.xml:31:5-40:16 Warning:
    activity#com.fireytail.slevelmaker.RunnerActivity@android:label was tagged at AndroidManifest.xml:31 to replace other declarations but no other declaration present
W:\com.fireytail.slevelmaker\src\main\AndroidManifest.xml:30:3-84:17 Warning:
    application@android:label was tagged at AndroidManifest.xml:30 to replace other declarations but no other declaration present
W:\com.fireytail.slevelmaker\src\main\AndroidManifest.xml:31:5-40:16 Warning:
    activity#com.fireytail.slevelmaker.RunnerActivity@android:label was tagged at AndroidManifest.xml:31 to replace other declarations but no other declaration present
W:\com.fireytail.slevelmaker\src\main\AndroidManifest.xml:30:3-84:17 Warning:
    application@android:label was tagged at AndroidManifest.xml:30 to replace other declarations but no other declaration present
W:\com.fireytail.slevelmaker\src\main\AndroidManifest.xml:31:5-40:16 Warning:
    activity#com.fireytail.slevelmaker.RunnerActivity@android:label was tagged at AndroidManifest.xml:31 to replace other declarations but no other declaration present
W:\com.fireytail.slevelmaker\src\main\AndroidManifest.xml:30:3-84:17 Warning:
    application@android:label was tagged at AndroidManifest.xml:30 to replace other declarations but no other declaration present
W:\com.fireytail.slevelmaker\src\main\AndroidManifest.xml:31:5-40:16 Warning:
    activity#com.fireytail.slevelmaker.RunnerActivity@android:label was tagged at AndroidManifest.xml:31 to replace other declarations but no other declaration present
W:\com.fireytail.slevelmaker\src\main\AndroidManifest.xml:30:3-84:17 Warning:
    application@android:label was tagged at AndroidManifest.xml:30 to replace other declarations but no other declaration present
W:\com.fireytail.slevelmaker\src\main\AndroidManifest.xml:31:5-40:16 Warning:
    activity#com.fireytail.slevelmaker.RunnerActivity@android:label was tagged at AndroidManifest.xml:31 to replace other declarations but no other declaration present

> Task :com.fireytail.slevelmaker:processDebugResources

> Task :com.fireytail.slevelmaker:compileDebugJavaWithJavac FAILED
W:\com.fireytail.slevelmaker\src\main\java\com\fireytail\slevelmaker\BillingRequests\BillingRequest.java:8: error: package com.android.vending.billing does not exist
import com.android.vending.billing.IInAppBillingService;
                                  ^
W:\com.fireytail.slevelmaker\src\main\java\com\fireytail\slevelmaker\BillingRequests\BillingRequest.java:20: error: cannot find symbol
    abstract protected void run(IInAppBillingService billingService) throws RemoteException;
                                ^
  symbol:   class IInAppBillingService
  location: class BillingRequest
W:\com.fireytail.slevelmaker\src\main\java\com\fireytail\slevelmaker\BillingRequests\GetPurchases.java:12: error: package com.android.vending.billing does not exist
import com.android.vending.billing.IInAppBillingService;
                                  ^
W:\com.fireytail.slevelmaker\src\main\java\com\fireytail\slevelmaker\BillingRequests\GetPurchases.java:19: error: cannot find symbol
    IRunnerBilling.IBillingCallback mCallback;
                  ^
  symbol:   class IBillingCallback
  location: class IRunnerBilling
W:\com.fireytail.slevelmaker\src\main\java\com\fireytail\slevelmaker\BillingRequests\GetPurchases.java:21: error: cannot find symbol
    public GetPurchases(IRunnerBilling.IBillingCallback callback)
                                      ^
  symbol:   class IBillingCallback
  location: class IRunnerBilling
W:\com.fireytail.slevelmaker\src\main\java\com\fireytail\slevelmaker\BillingRequests\GetPurchases.java:27: error: cannot find symbol
    protected void run(IInAppBillingService billingService) throws RemoteException
                       ^
  symbol:   class IInAppBillingService
  location: class GetPurchases
W:\com.fireytail.slevelmaker\src\main\java\com\fireytail\slevelmaker\BillingRequests\GetSkuDetails.java:13: error: package com.android.vending.billing does not exist
import com.android.vending.billing.IInAppBillingService;
                                  ^
W:\com.fireytail.slevelmaker\src\main\java\com\fireytail\slevelmaker\BillingRequests\GetSkuDetails.java:21: error: cannot find symbol
    IRunnerBilling.IBillingCallback mCallback;
                  ^
  symbol:   class IBillingCallback
  location: class IRunnerBilling
W:\com.fireytail.slevelmaker\src\main\java\com\fireytail\slevelmaker\BillingRequests\GetSkuDetails.java:23: error: cannot find symbol
    public GetSkuDetails(String[] productIds, IRunnerBilling.IBillingCallback callback)
                                                            ^
  symbol:   class IBillingCallback
  location: class IRunnerBilling
W:\com.fireytail.slevelmaker\src\main\java\com\fireytail\slevelmaker\BillingRequests\GetSkuDetails.java:30: error: cannot find symbol
    protected void run(IInAppBillingService billingService) throws RemoteException
                       ^
  symbol:   class IInAppBillingService
  location: class GetSkuDetails
W:\com.fireytail.slevelmaker\src\main\java\com\fireytail\slevelmaker\BillingRequests\RequestConsume.java:12: error: package com.android.vending.billing does not exist
import com.android.vending.billing.IInAppBillingService;
                                  ^
W:\com.fireytail.slevelmaker\src\main\java\com\fireytail\slevelmaker\BillingRequests\RequestConsume.java:20: error: cannot find symbol
    public final IRunnerBilling.IBillingCallback mCallback;
                               ^
  symbol:   class IBillingCallback
  location: class IRunnerBilling
W:\com.fireytail.slevelmaker\src\main\java\com\fireytail\slevelmaker\BillingRequests\RequestConsume.java:22: error: cannot find symbol
    public RequestConsume(String token, IRunnerBilling.IBillingCallback callback)
                                                      ^
  symbol:   class IBillingCallback
  location: class IRunnerBilling
W:\com.fireytail.slevelmaker\src\main\java\com\fireytail\slevelmaker\BillingRequests\RequestConsume.java:29: error: cannot find symbol
    protected void run(IInAppBillingService billingService) throws RemoteException
                       ^
  symbol:   class IInAppBillingService
  location: class RequestConsume
W:\com.fireytail.slevelmaker\src\main\java\com\fireytail\slevelmaker\BillingRequests\RequestPurchase.java:12: error: package com.android.vending.billing does not exist
import com.android.vending.billing.IInAppBillingService;
                                  ^
W:\com.fireytail.slevelmaker\src\main\java\com\fireytail\slevelmaker\BillingRequests\RequestPurchase.java:22: error: cannot find symbol
    public final IRunnerBilling.IBillingCallback mCallback;
                               ^
  symbol:   class IBillingCallback
  location: class IRunnerBilling
W:\com.fireytail.slevelmaker\src\main\java\com\fireytail\slevelmaker\BillingRequests\RequestPurchase.java:24: error: cannot find symbol
    public RequestPurchase(String productId, String developerPayload, int requestCode, IRunnerBilling.IBillingCallback callback)
                                                                                                     ^
  symbol:   class IBillingCallback
  location: class IRunnerBilling
W:\com.fireytail.slevelmaker\src\main\java\com\fireytail\slevelmaker\BillingRequests\RequestPurchase.java:33: error: cannot find symbol
    protected void run(IInAppBillingService billingService) throws RemoteException
                       ^
  symbol:   class IInAppBillingService
  location: class RequestPurchase
W:\com.fireytail.slevelmaker\src\main\java\com\fireytail\slevelmaker\GooglePlayServicesExtension.java:13: error: cannot find symbol
import android.support.v4.app.FragmentManager;
                             ^
  symbol:   class FragmentManager
  location: package android.support.v4.app
W:\com.fireytail.slevelmaker\src\main\java\com\fireytail\slevelmaker\GooglePlayServicesExtension.java:18: error: cannot find symbol
import android.support.v4.app.FragmentActivity;
                             ^
  symbol:   class FragmentActivity
  location: package android.support.v4.app
W:\com.fireytail.slevelmaker\src\main\java\com\fireytail\slevelmaker\RunnerBilling.java:24: error: package com.android.vending.billing does not exist
import com.android.vending.billing.IInAppBillingService;
                                  ^
W:\com.fireytail.slevelmaker\src\main\java\com\fireytail\slevelmaker\RunnerBilling.java:32: error: cannot find symbol
    private HashMap<Integer, PurchaseDetails> mPurchaseRequests = new HashMap<Integer, PurchaseDetails>();
                             ^
  symbol:   class PurchaseDetails
  location: class RunnerBilling
W:\com.fireytail.slevelmaker\src\main\java\com\fireytail\slevelmaker\RunnerBillingService.java:24: error: package com.android.vending.billing does not exist
import com.android.vending.billing.IInAppBillingService;
                                  ^
W:\com.fireytail.slevelmaker\src\main\java\com\fireytail\slevelmaker\RunnerBilling.java:143: error: cannot find symbol
    private void RetrieveSkuDetails(String[] _productIds, IBillingCallback _callback)
                                                          ^
  symbol:   class IBillingCallback
  location: class RunnerBilling
W:\com.fireytail.slevelmaker\src\main\java\com\fireytail\slevelmaker\RunnerBilling.java:178: error: cannot find symbol
    private void RetrievePurchases(IBillingCallback _callback)
                                   ^
  symbol:   class IBillingCallback
  location: class RunnerBilling
W:\com.fireytail.slevelmaker\src\main\java\com\fireytail\slevelmaker\RunnerBillingService.java:30: error: cannot find symbol
    private IInAppBillingService mService = null;
            ^
  symbol:   class IInAppBillingService
  location: class RunnerBillingService
W:\com.fireytail.slevelmaker\src\main\java\com\fireytail\slevelmaker\RunnerBillingService.java:33: error: cannot find symbol
    private IRunnerBilling.IBillingCallback mServiceConnectedCallback = null;
                          ^
  symbol:   class IBillingCallback
  location: class IRunnerBilling
W:\com.fireytail.slevelmaker\src\main\java\com\fireytail\slevelmaker\RunnerBillingService.java:61: error: cannot find symbol
    public boolean bindToBillingService(IRunnerBilling.IBillingCallback _serviceConnectedCallback)
                                                      ^
  symbol:   class IBillingCallback
  location: class IRunnerBilling
W:\com.fireytail.slevelmaker\src\main\java\com\fireytail\slevelmaker\RunnerBillingService.java:202: error: cannot find symbol
    public boolean requestPurchase(String productId, String developerPayload, int requestCode, IRunnerBilling.IBillingCallback callback)
                                                                                                             ^
  symbol:   class IBillingCallback
  location: class IRunnerBilling
W:\com.fireytail.slevelmaker\src\main\java\com\fireytail\slevelmaker\RunnerBillingService.java:212: error: cannot find symbol
    public boolean requestConsume(String token, IRunnerBilling.IBillingCallback callback)
                                                              ^
  symbol:   class IBillingCallback
  location: class IRunnerBilling
W:\com.fireytail.slevelmaker\src\main\java\com\fireytail\slevelmaker\RunnerBillingService.java:224: error: cannot find symbol
    public boolean requestSkuDetails(String[] productIds, IRunnerBilling.IBillingCallback callback)
                                                                        ^
  symbol:   class IBillingCallback
  location: class IRunnerBilling
W:\com.fireytail.slevelmaker\src\main\java\com\fireytail\slevelmaker\RunnerBillingService.java:233: error: cannot find symbol
    public boolean requestPurchases(IRunnerBilling.IBillingCallback callback)
                                                  ^
  symbol:   class IBillingCallback
  location: class IRunnerBilling
W:\com.fireytail.slevelmaker\src\main\java\com\fireytail\slevelmaker\RunnerBilling.java:32: error: cannot find symbol
    private HashMap<Integer, PurchaseDetails> mPurchaseRequests = new HashMap<Integer, PurchaseDetails>();
                                                                                       ^
  symbol:   class PurchaseDetails
  location: class RunnerBilling
W:\com.fireytail.slevelmaker\src\main\java\com\fireytail\slevelmaker\RunnerBilling.java:104: error: cannot find symbol
        mBillingService.bindToBillingService(new IBillingCallback() {
                                                 ^
  symbol:   class IBillingCallback
  location: class RunnerBilling
W:\com.fireytail.slevelmaker\src\main\java\com\fireytail\slevelmaker\RunnerBilling.java:145: error: cannot find symbol
        final IBillingCallback callback = _callback;
              ^
  symbol:   class IBillingCallback
  location: class RunnerBilling
W:\com.fireytail.slevelmaker\src\main\java\com\fireytail\slevelmaker\RunnerBilling.java:147: error: cannot find symbol
        mBillingService.requestSkuDetails(_productIds, new IBillingCallback() {
                                                           ^
  symbol:   class IBillingCallback
  location: class RunnerBilling
W:\com.fireytail.slevelmaker\src\main\java\com\fireytail\slevelmaker\RunnerBilling.java:180: error: cannot find symbol
        final IBillingCallback callback = _callback;
              ^
  symbol:   class IBillingCallback
  location: class RunnerBilling
W:\com.fireytail.slevelmaker\src\main\java\com\fireytail\slevelmaker\RunnerBilling.java:182: error: cannot find symbol
        mBillingService.requestPurchases(new IBillingCallback() {
                                             ^
  symbol:   class IBillingCallback
  location: class RunnerBilling
W:\com.fireytail.slevelmaker\src\main\java\com\fireytail\slevelmaker\RunnerBilling.java:249: error: cannot find symbol
        RunnerJNILib.IAPRestoreEvent(0);
                    ^
  symbol:   method IAPRestoreEvent(int)
  location: class RunnerJNILib
W:\com.fireytail.slevelmaker\src\main\java\com\fireytail\slevelmaker\RunnerBilling.java:264: error: cannot find symbol
        mPurchaseRequests.put(Integer.valueOf(requestCode), new PurchaseDetails(_productId, _purchaseIndex));
                                                                ^
  symbol:   class PurchaseDetails
  location: class RunnerBilling
W:\com.fireytail.slevelmaker\src\main\java\com\fireytail\slevelmaker\RunnerBilling.java:270: error: cannot find symbol
            new IBillingCallback() {
                ^
  symbol:   class IBillingCallback
  location: class RunnerBilling
W:\com.fireytail.slevelmaker\src\main\java\com\fireytail\slevelmaker\RunnerBilling.java:300: error: cannot find symbol
            new IBillingCallback() {
                ^
  symbol:   class IBillingCallback
  location: class RunnerBilling
W:\com.fireytail.slevelmaker\src\main\java\com\fireytail\slevelmaker\RunnerBilling.java:360: error: cannot find symbol
        RetrieveSkuDetails(productIds, new IBillingCallback() {
                                           ^
  symbol:   class IBillingCallback
  location: class RunnerBilling
W:\com.fireytail.slevelmaker\src\main\java\com\fireytail\slevelmaker\RunnerBilling.java:383: error: cannot find symbol
        registerContentPurchased(purchaseId, true);
        ^
  symbol:   method registerContentPurchased(String,boolean)
  location: class RunnerBilling
W:\com.fireytail.slevelmaker\src\main\java\com\fireytail\slevelmaker\RunnerBilling.java:391: error: cannot find symbol
        return md5encode("yoyo_purchase_" + contentId + "_punky_juular");
               ^
  symbol:   method md5encode(String)
  location: class RunnerBilling
W:\com.fireytail.slevelmaker\src\main\java\com\fireytail\slevelmaker\RunnerBilling.java:398: error: method does not override or implement a method from a supertype
    @Override
    ^
W:\com.fireytail.slevelmaker\src\main\java\com\fireytail\slevelmaker\RunnerBilling.java:402: error: cannot find symbol
        PurchaseDetails purchaseDetails = mPurchaseRequests.get(Integer.valueOf(_requestCode));
        ^
  symbol:   class PurchaseDetails
  location: class RunnerBilling
W:\com.fireytail.slevelmaker\src\main\java\com\fireytail\slevelmaker\RunnerBilling.java:448: error: cannot find symbol
                        RunnerJNILib.IAPProductPurchaseEvent(purchaseData);
                                    ^
  symbol:   method IAPProductPurchaseEvent(String)
  location: class RunnerJNILib
W:\com.fireytail.slevelmaker\src\main\java\com\fireytail\slevelmaker\RunnerBillingService.java:95: error: package IInAppBillingService does not exist
        mService = IInAppBillingService.Stub.asInterface(service);
                                       ^
W:\com.fireytail.slevelmaker\src\main\java\com\fireytail\slevelmaker\RunnerBillingService.java:175: error: cannot find symbol
            final IInAppBillingService service = mService;
                  ^
  symbol:   class IInAppBillingService
  location: class RunnerBillingService
Note: Some input files use or override a deprecated API.
Note: Recompile with -Xlint:deprecation for details.
Note: W:\com.fireytail.slevelmaker\src\main\java\com\fireytail\slevelmaker\GooglePlayServicesExtension.java uses unchecked or unsafe operations.
Note: Recompile with -Xlint:unchecked for details.
50 errors

FAILURE: Build failed with an exception.

* What went wrong:
Execution failed for task ':com.fireytail.slevelmaker:compileDebugJavaWithJavac'.
> Compilation failed; see the compiler error output for details.

* Try:
Run with --stacktrace option to get the stack trace. Run with --info or --debug option to get more log output. Run with --scan to get full insights.

* Get more help at https://help.gradle.org

Deprecated Gradle features were used in this build, making it incompatible with Gradle 6.0.
Use '--warning-mode all' to show the individual deprecation warnings.
See https://docs.gradle.org/5.1.1/userguide/command_line_interface.html#sec:command_line_warnings

BUILD FAILED in 20s
23 actionable tasks: 21 executed, 2 up-to-date


C:\windows\system32\cmd.exe exited with non-zero status (1)
Did you install SDK, NDK and Java through Android Studio 3.5 according to this setup guide: https://help.yoyogames.com/hc/en-us/articles/115001368727-Setting-Up-For-Android ?

If not, delete Android Studio, SDK, NDK and Java and install according to the setup guide.
Thank you, hope that works.

EDIT: That guide seems outdated, I can't follow it completely. See screenshots.

This is just great. Forums won't notify me of replies and now I can't even upload the screenshots. Not in PNG, not even in JPG format.

EDIT 2: I reinstalled Android Studio, SDK and JDK, however NDK option isn't showing up anywhere in SDK manager. So I chose the only option that appears instead, NDK (Side by side) and I'll test that once download is complete.

https://drive.google.com/open?id=1aSFHUm-D6Br6XQKnTtZPI5e-7I3s3Ugg

EDIT 3: I still get the very same error:

Since I'm exceeding 50K character limit, I'll have to double post.

EDIT 4: Oh great. It IS the output that's exceeding the 50K characters, so now I cannot post it...
 
Last edited:

fireYtail

Member
Now the output is smaller?

Code:
Saving project to: C:\Users\Adrián\Documents\GameMakerStudio2\fireYtail's Level Maker Full\fireYtail's Level Maker Full.yyp
"cmd"  /c subst Z: "C:\Users\Adrián\AppData\Roaming\GameMakerStudio2\Cache\GMS2CACHE"

elapsed time 00:00:00.0360041s for command "cmd" /c subst Z: "C:\Users\Adrián\AppData\Roaming\GameMakerStudio2\Cache\GMS2CACHE" started at 09/30/2019 00:42:01
"cmd"  /c subst Y: "C:\Users\Adrián\AppData\Local\GameMakerStudio2\GMS2TEMP"

elapsed time 00:00:00.0389980s for command "cmd" /c subst Y: "C:\Users\Adrián\AppData\Local\GameMakerStudio2\GMS2TEMP" started at 09/30/2019 00:42:01
"cmd"  /c subst X: "C:\ProgramData\GameMakerStudio2\Cache\runtimes\runtime-2.2.4.357"

elapsed time 00:00:00.0360026s for command "cmd" /c subst X: "C:\ProgramData\GameMakerStudio2\Cache\runtimes\runtime-2.2.4.357" started at 09/30/2019 00:42:01
"C:\ProgramData/GameMakerStudio2/Cache/runtimes\runtime-2.2.4.357/bin/Igor.exe"  -j=8 -options="C:\Users\Adrián\AppData\Local\GameMakerStudio2\GMS2TEMP\build.bff" -v -- Android Package

Loaded Macros from C:\Users\Adrián\AppData\Roaming\GameMakerStudio2\Cache\GMS2CACHE\fireYtail'_E1C5BC4_B82327DA\macros.json
Options: X:/bin\platform_setting_defaults.json
Options: C:\Users\Adrián\AppData\Roaming/GameMakerStudio2\AdrianBenitezCoca_2154408\local_settings.json
Options: C:\Users\Adrián\AppData\Roaming\GameMakerStudio2\Cache\GMS2CACHE\fireYtail'_E1C5BC4_B82327DA\targetoptions.json
X://bin/GMAssetCompiler.exe  /c /zpex /iv=0 /rv=0 /bv=0 /j=8  /gn="fireYtail's Level Maker Full" /td="Y:/" /cd="Z:/fireYtail'_E1C5BC4_B82327DA" /zpuf="C:\Users\Adrián\AppData\Roaming/GameMakerStudio2\AdrianBenitezCoca_2154408" /m=llvm-android /tgt=8 /llvmSource="X://yyc/"  /nodnd /cfg="default" /fU="Z:/fireYtail'_E1C5BC4_B82327DA\functionsUsed.txt" /o="Y:/fireYtail's_Level_Maker_Full_598D6F2E_YYC" /optionsini="Y:/fireYtail's_Level_Maker_Full_598D6F2E_YYC\options.ini" /baseproject="X:/BaseProject\BaseProject.yyp" "C:\Users\Adrián\Documents\GameMakerStudio2\fireYtail's Level Maker Full\fireYtail's Level Maker Full.yyp" /preprocess="Z:/fireYtail'_E1C5BC4_B82327DA"
Reading project file....C:\Users\Adrián\Documents\GameMakerStudio2\fireYtail's Level Maker Full
Reading project file....X:\BaseProject
Reading config delta 'C:\Users\Adrián\Documents\GameMakerStudio2\fireYtail's Level Maker Full\options\main\inherited\options_main.inherited.yy'
finished.


X://bin/GMAssetCompiler.exe DONE (0)
Release build
Options: Z:/fireYtail'_E1C5BC4_B82327DA\ExtensionOptions.json
PlatformOptions
Options: Z:/fireYtail'_E1C5BC4_B82327DA\PlatformOptions.json
Options: Z:/fireYtail'_E1C5BC4_B82327DA\MainOptions.json
displayname
hostname
runtime
C:\SDK\platform-tools\adb connect "emulator-5554"
cannot resolve host 'emulator-5554' and port 5555: Host desconocido. (11001)


C:\SDK\platform-tools\adb DONE (0)
C:\SDK\platform-tools\adb devices
List of devices attached



C:\SDK\platform-tools\adb DONE (0)
OptionsIni
PlatformOptions
X://bin/GMAssetCompiler.exe  /c /zpex /iv=0 /rv=0 /bv=0 /j=8  /gn="fireYtail's Level Maker Full" /td="Y:/" /cd="Z:/fireYtail'_E1C5BC4_B82327DA" /zpuf="C:\Users\Adrián\AppData\Roaming/GameMakerStudio2\AdrianBenitezCoca_2154408" /m=llvm-android /tgt=8 /llvmSource="X://yyc/"  /nodnd /cfg="default" /fU="Z:/fireYtail'_E1C5BC4_B82327DA\functionsUsed.txt" /o="Y:/fireYtail's_Level_Maker_Full_598D6F2E_YYC" /optionsini="Y:/fireYtail's_Level_Maker_Full_598D6F2E_YYC\options.ini" /baseproject="X:/BaseProject\BaseProject.yyp" "C:\Users\Adrián\Documents\GameMakerStudio2\fireYtail's Level Maker Full\fireYtail's Level Maker Full.yyp" /arch=54 /bt=exe /rt=yyc
Reading project file....C:\Users\Adrián\Documents\GameMakerStudio2\fireYtail's Level Maker Full
Reading project file....X:\BaseProject
Reading config delta 'C:\Users\Adrián\Documents\GameMakerStudio2\fireYtail's Level Maker Full\options\main\inherited\options_main.inherited.yy'
finished.
Compile Constants...finished.
Remove DnD...finished.
Compile Scripts...finished.
Compile Objects...finished.
Compile Timelines...finished.
Compile Triggers...finished.
Compile Rooms...finished.
Compile Extensions...finished.
Global scripts...finished.
finished.
collapsing enums.
Final Compile...finished.
Writing Chunk... GEN8
option_game_speed=60
Writing Chunk... OPTN
Writing Chunk... LANG
Writing Chunk... EXTN
Writing Chunk... SOND
Writing Chunk... AGRP
Writing Chunk... SPRT
Writing Chunk... BGND
Writing Chunk... PATH
Writing Chunk... SCPT
Writing Chunk... GLOB
Writing Chunk... SHDR
Writing Chunk... FONT
Writing Chunk... TMLN
Writing Chunk... OBJT
Writing Chunk... ROOM
Writing Chunk... DAFL
Writing Chunk... EMBI
Writing Chunk... TPAGE
Texture Group - Default
Writing Chunk... TGIN
Writing Chunk... STRG
Writing Chunk... TXTR
0 Compressing texture... writing texture texture_0.png...
1 Compressing texture... writing texture texture_1.png...
2 Compressing texture... writing texture texture_2.png...
3 Compressing texture... writing texture texture_3.png...
4 Compressing texture... writing texture texture_4.png...
5 Compressing texture... writing texture texture_5.png...
6 Compressing texture... writing texture texture_6.png...
7 Compressing texture... writing texture texture_7.png...
8 Compressing texture... writing texture texture_8.png...
9 Compressing texture... writing texture texture_9.png...
10 Compressing texture... writing texture texture_10.png...
11 Compressing texture... writing texture texture_11.png...
12 Compressing texture... writing texture texture_12.png...
13 Compressing texture... writing texture texture_13.png...
14 Compressing texture... writing texture texture_14.png...
15 Compressing texture... writing texture texture_15.png...
16 Compressing texture... writing texture texture_16.png...
17 Compressing texture... writing texture texture_17.png...
18 Compressing texture... writing texture texture_18.png...
19 Compressing texture... writing texture texture_19.png...
Writing Chunk... AUDO
ClangExeLocation=C:\SDK\ndk\20.0.5594570\toolchains\llvm\prebuilt\windows-x86_64\bin\clang++.exe
Using NDKDir = C:\SDK\ndk\20.0.5594570
Using PlatformDir = C:\SDK\ndk\20.0.5594570\platforms\android-29
Using ARMToolChain = C:\SDK\ndk\20.0.5594570\toolchains\arm-linux-androideabi-4.9\prebuilt\windows-x86_64
Using X86ToolChain = C:\SDK\ndk\20.0.5594570\toolchains\x86-4.9\prebuilt\windows-x86_64
Using ARM64ToolChain = C:\SDK\ndk\20.0.5594570\toolchains\aarch64-linux-android-4.9\prebuilt\windows-x86_64
Using X86_64ToolChain = C:\SDK\ndk\20.0.5594570\toolchains\x86_64-4.9\prebuilt\windows-x86_64
saving file Y:/fireYtail's_Level_Maker_Full_598D6F2E_YYC\fireYtail's Level Maker Full.droid
Android NDK: android-14 is unsupported. Using minimum supported version android-16. 
Android NDK: WARNING: APP_PLATFORM android-16 is higher than android:minSdkVersion 14 in ./AndroidManifest.xml. NDK binaries will *not* be compatible with devices older than android-16. See https://android.googlesource.com/platform/ndk/+/master/docs/user/common_problems.md for more information. 
[armeabi-v7a] Compile++ arm  : yoyo <= fireYtail_s_Level_Maker_Full.vars.cpp
[x86] Compile++      : yoyo <= fireYtail_s_Level_Maker_Full.vars.cpp
[arm64-v8a] Compile++      : yoyo <= fireYtail_s_Level_Maker_Full.vars.cpp
[x86_64] Compile++      : yoyo <= fireYtail_s_Level_Maker_Full.vars.cpp
[armeabi-v7a] Install        : libc++_shared.so => Y:/fireYtail's_Level_Maker_Full_598D6F2E_YYC/lib/armeabi-v7a/libc++_shared.so
[x86] Install        : libc++_shared.so => Y:/fireYtail's_Level_Maker_Full_598D6F2E_YYC/lib/x86/libc++_shared.so
[arm64-v8a] Install        : libc++_shared.so => Y:/fireYtail's_Level_Maker_Full_598D6F2E_YYC/lib/arm64-v8a/libc++_shared.so
[x86_64] Install        : libc++_shared.so => Y:/fireYtail's_Level_Maker_Full_598D6F2E_YYC/lib/x86_64/libc++_shared.so
[armeabi-v7a] SharedLibrary  : libyoyo.so
[x86] SharedLibrary  : libyoyo.so
[arm64-v8a] SharedLibrary  : libyoyo.so
[x86_64] SharedLibrary  : libyoyo.so
[x86] Install        : libyoyo.so => Y:/fireYtail's_Level_Maker_Full_598D6F2E_YYC/lib/x86/libyoyo.so
[armeabi-v7a] Install        : libyoyo.so => Y:/fireYtail's_Level_Maker_Full_598D6F2E_YYC/lib/armeabi-v7a/libyoyo.so
[x86_64] Install        : libyoyo.so => Y:/fireYtail's_Level_Maker_Full_598D6F2E_YYC/lib/x86_64/libyoyo.so
[arm64-v8a] Install        : libyoyo.so => Y:/fireYtail's_Level_Maker_Full_598D6F2E_YYC/lib/arm64-v8a/libyoyo.so
Stats : GMA : Elapsed=5320,0042
Stats : GMA : sp=241,au=7,bk=0,pt=0,sc=29,sh=0,fo=3,tl=0,ob=15,ro=1,da=1,ex=3,ma=2,fm=0x80B20008A00A24


X://bin/GMAssetCompiler.exe DONE (0)
AndroidEnvironment
Manifest Permissions
Manifest Metadata
Check GML functions
Licensing
8
Copying C:\Users\Adrián\Documents\GameMakerStudio2\fireYtail's Level Maker Full\extensions\GooglePlayServicesIAPExtension\AndroidSource\java\RunnerBilling.java to Z:/fireYtail'_E1C5BC4_B82327DA\Android\default\com.fireytail.slevelmaker\src\main\java\com\fireytail\slevelmaker\RunnerBilling.java...
Copying C:\Users\Adrián\Documents\GameMakerStudio2\fireYtail's Level Maker Full\extensions\GooglePlayServicesIAPExtension\AndroidSource\java\RunnerBillingSecurity.java to Z:/fireYtail'_E1C5BC4_B82327DA\Android\default\com.fireytail.slevelmaker\src\main\java\com\fireytail\slevelmaker\RunnerBillingSecurity.java...
Copying C:\Users\Adrián\Documents\GameMakerStudio2\fireYtail's Level Maker Full\extensions\GooglePlayServicesIAPExtension\AndroidSource\java\RunnerBillingService.java to Z:/fireYtail'_E1C5BC4_B82327DA\Android\default\com.fireytail.slevelmaker\src\main\java\com\fireytail\slevelmaker\RunnerBillingService.java...
Copying C:\Users\Adrián\Documents\GameMakerStudio2\fireYtail's Level Maker Full\extensions\GooglePlayServicesIAPExtension\AndroidSource\java\BillingRequests\BillingRequest.java to Z:/fireYtail'_E1C5BC4_B82327DA\Android\default\com.fireytail.slevelmaker\src\main\java\com\fireytail\slevelmaker\BillingRequests\BillingRequest.java...
Copying C:\Users\Adrián\Documents\GameMakerStudio2\fireYtail's Level Maker Full\extensions\GooglePlayServicesIAPExtension\AndroidSource\java\BillingRequests\GetPurchases.java to Z:/fireYtail'_E1C5BC4_B82327DA\Android\default\com.fireytail.slevelmaker\src\main\java\com\fireytail\slevelmaker\BillingRequests\GetPurchases.java...
Copying C:\Users\Adrián\Documents\GameMakerStudio2\fireYtail's Level Maker Full\extensions\GooglePlayServicesIAPExtension\AndroidSource\java\BillingRequests\GetSkuDetails.java to Z:/fireYtail'_E1C5BC4_B82327DA\Android\default\com.fireytail.slevelmaker\src\main\java\com\fireytail\slevelmaker\BillingRequests\GetSkuDetails.java...
Copying C:\Users\Adrián\Documents\GameMakerStudio2\fireYtail's Level Maker Full\extensions\GooglePlayServicesIAPExtension\AndroidSource\java\BillingRequests\RequestConsume.java to Z:/fireYtail'_E1C5BC4_B82327DA\Android\default\com.fireytail.slevelmaker\src\main\java\com\fireytail\slevelmaker\BillingRequests\RequestConsume.java...
Copying C:\Users\Adrián\Documents\GameMakerStudio2\fireYtail's Level Maker Full\extensions\GooglePlayServicesIAPExtension\AndroidSource\java\BillingRequests\RequestPurchase.java to Z:/fireYtail'_E1C5BC4_B82327DA\Android\default\com.fireytail.slevelmaker\src\main\java\com\fireytail\slevelmaker\BillingRequests\RequestPurchase.java...
1
Copying C:\Users\Adrián\Documents\GameMakerStudio2\fireYtail's Level Maker Full\extensions\GooglePlayLicensingAsExt\AndroidSource\java\GooglePlayLicensingAsExt.java to Z:/fireYtail'_E1C5BC4_B82327DA\Android\default\com.fireytail.slevelmaker\src\main\java\com\fireytail\slevelmaker\GooglePlayLicensingAsExt.java...
1
Copying X:/Android\runner\ExtensionFiles\build.gradle to Z:/fireYtail'_E1C5BC4_B82327DA\Android\default\allib\build.gradle...
3
Copying C:\Users\Adrián\Documents\GameMakerStudio2\fireYtail's Level Maker Full\extensions\GooglePlayServicesExtension\AndroidSource\java\BaseGameUtils.java to Z:/fireYtail'_E1C5BC4_B82327DA\Android\default\com.fireytail.slevelmaker\src\main\java\com\fireytail\slevelmaker\BaseGameUtils.java...
Copying C:\Users\Adrián\Documents\GameMakerStudio2\fireYtail's Level Maker Full\extensions\GooglePlayServicesExtension\AndroidSource\java\GooglePlayServicesExtension.java to Z:/fireYtail'_E1C5BC4_B82327DA\Android\default\com.fireytail.slevelmaker\src\main\java\com\fireytail\slevelmaker\GooglePlayServicesExtension.java...
Copying C:\Users\Adrián\Documents\GameMakerStudio2\fireYtail's Level Maker Full\extensions\GooglePlayServicesExtension\AndroidSource\java\RunnerBillingInterface.java to Z:/fireYtail'_E1C5BC4_B82327DA\Android\default\com.fireytail.slevelmaker\src\main\java\com\fireytail\slevelmaker\RunnerBillingInterface.java...
1
Copying C:\Users\Adrián\Documents\GameMakerStudio2\fireYtail's Level Maker Full\extensions\GooglePlayServicesExtension\AndroidSource\res\values\gps_strings.xml to Z:/fireYtail'_E1C5BC4_B82327DA\Android\default\com.fireytail.slevelmaker\src\main\res\values\gps_strings.xml...
3
Copying X:/Android\runner\RootFiles\build.gradle to Z:/fireYtail'_E1C5BC4_B82327DA\Android\default\build.gradle...
Copying X:/Android\runner\RootFiles\gradle.properties to Z:/fireYtail'_E1C5BC4_B82327DA\Android\default\gradle.properties...
Copying X:/Android\runner\RootFiles\settings.gradle to Z:/fireYtail'_E1C5BC4_B82327DA\Android\default\settings.gradle...
59
Copying X:/Android\runner\ProjectFiles\build.gradle to Z:/fireYtail'_E1C5BC4_B82327DA\Android\default\com.fireytail.slevelmaker\build.gradle...
Copying X:/Android\runner\ProjectFiles\lint.xml to Z:/fireYtail'_E1C5BC4_B82327DA\Android\default\com.fireytail.slevelmaker\lint.xml...
Copying X:/Android\runner\ProjectFiles\libs\ini4j-0.5.2.jar to Z:/fireYtail'_E1C5BC4_B82327DA\Android\default\com.fireytail.slevelmaker\libs\ini4j-0.5.2.jar...
Copying X:/Android\runner\ProjectFiles\libs\org.apache.http.legacy.jar to Z:/fireYtail'_E1C5BC4_B82327DA\Android\default\com.fireytail.slevelmaker\libs\org.apache.http.legacy.jar...
Copying X:/Android\runner\ProjectFiles\src\main\AndroidManifest.xml to Z:/fireYtail'_E1C5BC4_B82327DA\Android\default\com.fireytail.slevelmaker\src\main\AndroidManifest.xml...
Copying X:/Android\runner\ProjectFiles\src\main\assets\splash.png to Z:/fireYtail'_E1C5BC4_B82327DA\Android\default\com.fireytail.slevelmaker\src\main\assets\splash.png...
Copying X:/Android\runner\ProjectFiles\src\main\java\com\yoyogames\runner\RunnerJNILib.java to Z:/fireYtail'_E1C5BC4_B82327DA\Android\default\com.fireytail.slevelmaker\src\main\java\com\yoyogames\runner\RunnerJNILib.java...
Copying X:/Android\runner\ProjectFiles\src\main\java\YYAndroidPackageDomain\YYAndroidPackageCompany\YYAndroidPackageProduct\AdvertisingBase.java to Z:/fireYtail'_E1C5BC4_B82327DA\Android\default\com.fireytail.slevelmaker\src\main\java\com\fireytail\slevelmaker\AdvertisingBase.java...
Copying X:/Android\runner\ProjectFiles\src\main\java\YYAndroidPackageDomain\YYAndroidPackageCompany\YYAndroidPackageProduct\DemoGLSurfaceView.java to Z:/fireYtail'_E1C5BC4_B82327DA\Android\default\com.fireytail.slevelmaker\src\main\java\com\fireytail\slevelmaker\DemoGLSurfaceView.java...
Copying X:/Android\runner\ProjectFiles\src\main\java\YYAndroidPackageDomain\YYAndroidPackageCompany\YYAndroidPackageProduct\DemoRenderer.java to Z:/fireYtail'_E1C5BC4_B82327DA\Android\default\com.fireytail.slevelmaker\src\main\java\com\fireytail\slevelmaker\DemoRenderer.java...
Copying X:/Android\runner\ProjectFiles\src\main\java\YYAndroidPackageDomain\YYAndroidPackageCompany\YYAndroidPackageProduct\DemoRendererGL2.java to Z:/fireYtail'_E1C5BC4_B82327DA\Android\default\com.fireytail.slevelmaker\src\main\java\com\fireytail\slevelmaker\DemoRendererGL2.java...
Copying X:/Android\runner\ProjectFiles\src\main\java\YYAndroidPackageDomain\YYAndroidPackageCompany\YYAndroidPackageProduct\ExtensionBase.java to Z:/fireYtail'_E1C5BC4_B82327DA\Android\default\com.fireytail.slevelmaker\src\main\java\com\fireytail\slevelmaker\ExtensionBase.java...
Copying X:/Android\runner\ProjectFiles\src\main\java\YYAndroidPackageDomain\YYAndroidPackageCompany\YYAndroidPackageProduct\IAdExt.java to Z:/fireYtail'_E1C5BC4_B82327DA\Android\default\com.fireytail.slevelmaker\src\main\java\com\fireytail\slevelmaker\IAdExt.java...
Copying X:/Android\runner\ProjectFiles\src\main\java\YYAndroidPackageDomain\YYAndroidPackageCompany\YYAndroidPackageProduct\IAdvertising.java to Z:/fireYtail'_E1C5BC4_B82327DA\Android\default\com.fireytail.slevelmaker\src\main\java\com\fireytail\slevelmaker\IAdvertising.java...
Copying X:/Android\runner\ProjectFiles\src\main\java\YYAndroidPackageDomain\YYAndroidPackageCompany\YYAndroidPackageProduct\IExtensionBase.java to Z:/fireYtail'_E1C5BC4_B82327DA\Android\default\com.fireytail.slevelmaker\src\main\java\com\fireytail\slevelmaker\IExtensionBase.java...
Copying X:/Android\runner\ProjectFiles\src\main\java\YYAndroidPackageDomain\YYAndroidPackageCompany\YYAndroidPackageProduct\IniBundle.java to Z:/fireYtail'_E1C5BC4_B82327DA\Android\default\com.fireytail.slevelmaker\src\main\java\com\fireytail\slevelmaker\IniBundle.java...
Copying X:/Android\runner\ProjectFiles\src\main\java\YYAndroidPackageDomain\YYAndroidPackageCompany\YYAndroidPackageProduct\ISocial.java to Z:/fireYtail'_E1C5BC4_B82327DA\Android\default\com.fireytail.slevelmaker\src\main\java\com\fireytail\slevelmaker\ISocial.java...
Copying X:/Android\runner\ProjectFiles\src\main\java\YYAndroidPackageDomain\YYAndroidPackageCompany\YYAndroidPackageProduct\RunnerActivity.java to Z:/fireYtail'_E1C5BC4_B82327DA\Android\default\com.fireytail.slevelmaker\src\main\java\com\fireytail\slevelmaker\RunnerActivity.java...
Copying X:/Android\runner\ProjectFiles\src\main\java\YYAndroidPackageDomain\YYAndroidPackageCompany\YYAndroidPackageProduct\RunnerAdExt.java to Z:/fireYtail'_E1C5BC4_B82327DA\Android\default\com.fireytail.slevelmaker\src\main\java\com\fireytail\slevelmaker\RunnerAdExt.java...
Copying X:/Android\runner\ProjectFiles\src\main\java\YYAndroidPackageDomain\YYAndroidPackageCompany\YYAndroidPackageProduct\RunnerApplication.java to Z:/fireYtail'_E1C5BC4_B82327DA\Android\default\com.fireytail.slevelmaker\src\main\java\com\fireytail\slevelmaker\RunnerApplication.java...
Copying X:/Android\runner\ProjectFiles\src\main\java\YYAndroidPackageDomain\YYAndroidPackageCompany\YYAndroidPackageProduct\RunnerKeyboardController.java to Z:/fireYtail'_E1C5BC4_B82327DA\Android\default\com.fireytail.slevelmaker\src\main\java\com\fireytail\slevelmaker\RunnerKeyboardController.java...
Copying X:/Android\runner\ProjectFiles\src\main\java\YYAndroidPackageDomain\YYAndroidPackageCompany\YYAndroidPackageProduct\RunnerSocial.java to Z:/fireYtail'_E1C5BC4_B82327DA\Android\default\com.fireytail.slevelmaker\src\main\java\com\fireytail\slevelmaker\RunnerSocial.java...
Copying X:/Android\runner\ProjectFiles\src\main\java\YYAndroidPackageDomain\YYAndroidPackageCompany\YYAndroidPackageProduct\RunnerVsyncHandler.java to Z:/fireYtail'_E1C5BC4_B82327DA\Android\default\com.fireytail.slevelmaker\src\main\java\com\fireytail\slevelmaker\RunnerVsyncHandler.java...
Copying X:/Android\runner\ProjectFiles\src\main\java\YYAndroidPackageDomain\YYAndroidPackageCompany\YYAndroidPackageProduct\Gamepad\Gamepad.java to Z:/fireYtail'_E1C5BC4_B82327DA\Android\default\com.fireytail.slevelmaker\src\main\java\com\fireytail\slevelmaker\Gamepad\Gamepad.java...
Copying X:/Android\runner\ProjectFiles\src\main\java\YYAndroidPackageDomain\YYAndroidPackageCompany\YYAndroidPackageProduct\Purchases\IRunnerBilling.java to Z:/fireYtail'_E1C5BC4_B82327DA\Android\default\com.fireytail.slevelmaker\src\main\java\com\fireytail\slevelmaker\Purchases\IRunnerBilling.java...
Copying X:/Android\runner\ProjectFiles\src\main\java\YYAndroidPackageDomain\YYAndroidPackageCompany\YYAndroidPackageProduct\Purchases\Null\NullBilling.java to Z:/fireYtail'_E1C5BC4_B82327DA\Android\default\com.fireytail.slevelmaker\src\main\java\com\fireytail\slevelmaker\Purchases\Null\NullBilling.java...
Copying X:/Android\runner\ProjectFiles\src\main\jniLibs\arm64-v8a\libc++_shared.so to Z:/fireYtail'_E1C5BC4_B82327DA\Android\default\com.fireytail.slevelmaker\src\main\jniLibs\arm64-v8a\libc++_shared.so...
Copying X:/Android\runner\ProjectFiles\src\main\jniLibs\arm64-v8a\libyoyo.so to Z:/fireYtail'_E1C5BC4_B82327DA\Android\default\com.fireytail.slevelmaker\src\main\jniLibs\arm64-v8a\libyoyo.so...
Copying X:/Android\runner\ProjectFiles\src\main\jniLibs\armeabi\libyoyo.so to Z:/fireYtail'_E1C5BC4_B82327DA\Android\default\com.fireytail.slevelmaker\src\main\jniLibs\armeabi\libyoyo.so...
Copying X:/Android\runner\ProjectFiles\src\main\jniLibs\armeabi-v7a\libc++_shared.so to Z:/fireYtail'_E1C5BC4_B82327DA\Android\default\com.fireytail.slevelmaker\src\main\jniLibs\armeabi-v7a\libc++_shared.so...
Copying X:/Android\runner\ProjectFiles\src\main\jniLibs\armeabi-v7a\libyoyo.so to Z:/fireYtail'_E1C5BC4_B82327DA\Android\default\com.fireytail.slevelmaker\src\main\jniLibs\armeabi-v7a\libyoyo.so...
Copying X:/Android\runner\ProjectFiles\src\main\jniLibs\mips\libyoyo.so to Z:/fireYtail'_E1C5BC4_B82327DA\Android\default\com.fireytail.slevelmaker\src\main\jniLibs\mips\libyoyo.so...
Copying X:/Android\runner\ProjectFiles\src\main\jniLibs\mips64\libyoyo.so to Z:/fireYtail'_E1C5BC4_B82327DA\Android\default\com.fireytail.slevelmaker\src\main\jniLibs\mips64\libyoyo.so...
Copying X:/Android\runner\ProjectFiles\src\main\jniLibs\x86\libc++_shared.so to Z:/fireYtail'_E1C5BC4_B82327DA\Android\default\com.fireytail.slevelmaker\src\main\jniLibs\x86\libc++_shared.so...
Copying X:/Android\runner\ProjectFiles\src\main\jniLibs\x86\libyoyo.so to Z:/fireYtail'_E1C5BC4_B82327DA\Android\default\com.fireytail.slevelmaker\src\main\jniLibs\x86\libyoyo.so...
Copying X:/Android\runner\ProjectFiles\src\main\jniLibs\x86_64\libc++_shared.so to Z:/fireYtail'_E1C5BC4_B82327DA\Android\default\com.fireytail.slevelmaker\src\main\jniLibs\x86_64\libc++_shared.so...
Copying X:/Android\runner\ProjectFiles\src\main\jniLibs\x86_64\libyoyo.so to Z:/fireYtail'_E1C5BC4_B82327DA\Android\default\com.fireytail.slevelmaker\src\main\jniLibs\x86_64\libyoyo.so...
Copying X:/Android\runner\ProjectFiles\src\main\res\drawable-hdpi\icon.png to Z:/fireYtail'_E1C5BC4_B82327DA\Android\default\com.fireytail.slevelmaker\src\main\res\drawable-hdpi\icon.png...
Copying X:/Android\runner\ProjectFiles\src\main\res\drawable-hdpi-v26\adaptive_bg.png to Z:/fireYtail'_E1C5BC4_B82327DA\Android\default\com.fireytail.slevelmaker\src\main\res\drawable-hdpi-v26\adaptive_bg.png...
Copying X:/Android\runner\ProjectFiles\src\main\res\drawable-hdpi-v26\adaptive_icon.png to Z:/fireYtail'_E1C5BC4_B82327DA\Android\default\com.fireytail.slevelmaker\src\main\res\drawable-hdpi-v26\adaptive_icon.png...
Copying X:/Android\runner\ProjectFiles\src\main\res\drawable-hdpi-v26\icon.xml to Z:/fireYtail'_E1C5BC4_B82327DA\Android\default\com.fireytail.slevelmaker\src\main\res\drawable-hdpi-v26\icon.xml...
Copying X:/Android\runner\ProjectFiles\src\main\res\drawable-ldpi-v26\adaptive_bg.png to Z:/fireYtail'_E1C5BC4_B82327DA\Android\default\com.fireytail.slevelmaker\src\main\res\drawable-ldpi-v26\adaptive_bg.png...
Copying X:/Android\runner\ProjectFiles\src\main\res\drawable-ldpi-v26\adaptive_icon.png to Z:/fireYtail'_E1C5BC4_B82327DA\Android\default\com.fireytail.slevelmaker\src\main\res\drawable-ldpi-v26\adaptive_icon.png...
Copying X:/Android\runner\ProjectFiles\src\main\res\drawable-ldpi-v26\icon.xml to Z:/fireYtail'_E1C5BC4_B82327DA\Android\default\com.fireytail.slevelmaker\src\main\res\drawable-ldpi-v26\icon.xml...
Copying X:/Android\runner\ProjectFiles\src\main\res\drawable-mdpi-v26\adaptive_bg.png to Z:/fireYtail'_E1C5BC4_B82327DA\Android\default\com.fireytail.slevelmaker\src\main\res\drawable-mdpi-v26\adaptive_bg.png...
Copying X:/Android\runner\ProjectFiles\src\main\res\drawable-mdpi-v26\adaptive_icon.png to Z:/fireYtail'_E1C5BC4_B82327DA\Android\default\com.fireytail.slevelmaker\src\main\res\drawable-mdpi-v26\adaptive_icon.png...
Copying X:/Android\runner\ProjectFiles\src\main\res\drawable-mdpi-v26\icon.xml to Z:/fireYtail'_E1C5BC4_B82327DA\Android\default\com.fireytail.slevelmaker\src\main\res\drawable-mdpi-v26\icon.xml...
Copying X:/Android\runner\ProjectFiles\src\main\res\drawable-xhdpi-v26\adaptive_bg.png to Z:/fireYtail'_E1C5BC4_B82327DA\Android\default\com.fireytail.slevelmaker\src\main\res\drawable-xhdpi-v26\adaptive_bg.png...
Copying X:/Android\runner\ProjectFiles\src\main\res\drawable-xhdpi-v26\adaptive_icon.png to Z:/fireYtail'_E1C5BC4_B82327DA\Android\default\com.fireytail.slevelmaker\src\main\res\drawable-xhdpi-v26\adaptive_icon.png...
Copying X:/Android\runner\ProjectFiles\src\main\res\drawable-xhdpi-v26\icon.xml to Z:/fireYtail'_E1C5BC4_B82327DA\Android\default\com.fireytail.slevelmaker\src\main\res\drawable-xhdpi-v26\icon.xml...
Copying X:/Android\runner\ProjectFiles\src\main\res\drawable-xxhdpi-v26\adaptive_bg.png to Z:/fireYtail'_E1C5BC4_B82327DA\Android\default\com.fireytail.slevelmaker\src\main\res\drawable-xxhdpi-v26\adaptive_bg.png...
Copying X:/Android\runner\ProjectFiles\src\main\res\drawable-xxhdpi-v26\adaptive_icon.png to Z:/fireYtail'_E1C5BC4_B82327DA\Android\default\com.fireytail.slevelmaker\src\main\res\drawable-xxhdpi-v26\adaptive_icon.png...
Copying X:/Android\runner\ProjectFiles\src\main\res\drawable-xxhdpi-v26\icon.xml to Z:/fireYtail'_E1C5BC4_B82327DA\Android\default\com.fireytail.slevelmaker\src\main\res\drawable-xxhdpi-v26\icon.xml...
Copying X:/Android\runner\ProjectFiles\src\main\res\drawable-xxxhdpi-v26\adaptive_bg.png to Z:/fireYtail'_E1C5BC4_B82327DA\Android\default\com.fireytail.slevelmaker\src\main\res\drawable-xxxhdpi-v26\adaptive_bg.png...
Copying X:/Android\runner\ProjectFiles\src\main\res\drawable-xxxhdpi-v26\adaptive_icon.png to Z:/fireYtail'_E1C5BC4_B82327DA\Android\default\com.fireytail.slevelmaker\src\main\res\drawable-xxxhdpi-v26\adaptive_icon.png...
Copying X:/Android\runner\ProjectFiles\src\main\res\drawable-xxxhdpi-v26\icon.xml to Z:/fireYtail'_E1C5BC4_B82327DA\Android\default\com.fireytail.slevelmaker\src\main\res\drawable-xxxhdpi-v26\icon.xml...
Copying X:/Android\runner\ProjectFiles\src\main\res\layout\main.xml to Z:/fireYtail'_E1C5BC4_B82327DA\Android\default\com.fireytail.slevelmaker\src\main\res\layout\main.xml...
Copying X:/Android\runner\ProjectFiles\src\main\res\layout\userpasslayout.xml to Z:/fireYtail'_E1C5BC4_B82327DA\Android\default\com.fireytail.slevelmaker\src\main\res\layout\userpasslayout.xml...
Copying X:/Android\runner\ProjectFiles\src\main\res\values\strings.xml to Z:/fireYtail'_E1C5BC4_B82327DA\Android\default\com.fireytail.slevelmaker\src\main\res\values\strings.xml...
DoSplash
DoIcon
C:\windows\system32\cmd.exe /c "subst U: "Z:/fireYtail'_E1C5BC4_B82327DA\Android\default" && U: && cd "com.fireytail.slevelmaker" && "X:/Android\runner\gradle\gradlew" build  bundleRelease  -x lint  "

> Configure project :allib
WARNING: Configuration 'compile' is obsolete and has been replaced with 'implementation' and 'api'.
It will be removed at the end of 2018. For more information see: http://d.android.com/r/tools/update-dependency-configurations.html

> Configure project :com.fireytail.slevelmaker
WARNING: Configuration 'compile' is obsolete and has been replaced with 'implementation' and 'api'.
It will be removed at the end of 2018. For more information see: http://d.android.com/r/tools/update-dependency-configurations.html

> Task :allib:preBuild UP-TO-DATE
> Task :allib:preDebugBuild UP-TO-DATE
> Task :allib:compileDebugAidl NO-SOURCE
> Task :allib:compileDebugRenderscript
> Task :allib:checkDebugManifest
> Task :allib:generateDebugBuildConfig
> Task :allib:generateDebugResValues
> Task :allib:generateDebugResources
> Task :allib:packageDebugResources
> Task :allib:processDebugManifest
> Task :allib:generateDebugRFile
> Task :allib:prepareLintJar UP-TO-DATE
> Task :allib:generateDebugSources
> Task :allib:javaPreCompileDebug

> Task :allib:compileDebugJavaWithJavac
Note: U:\allib\src\com\google\android\vending\licensing\LicenseChecker.java uses or overrides a deprecated API.
Note: Recompile with -Xlint:deprecation for details.

> Task :allib:bundleLibCompileDebug
> Task :com.fireytail.slevelmaker:preBuild UP-TO-DATE
> Task :com.fireytail.slevelmaker:preDebugBuild
> Task :com.fireytail.slevelmaker:compileDebugAidl NO-SOURCE
> Task :allib:packageDebugRenderscript NO-SOURCE
> Task :com.fireytail.slevelmaker:compileDebugRenderscript NO-SOURCE
> Task :com.fireytail.slevelmaker:checkDebugManifest
> Task :com.fireytail.slevelmaker:generateDebugBuildConfig
> Task :com.fireytail.slevelmaker:prepareLintJar UP-TO-DATE
> Task :com.fireytail.slevelmaker:generateDebugSources
> Task :com.fireytail.slevelmaker:javaPreCompileDebug
> Task :com.fireytail.slevelmaker:mainApkListPersistenceDebug
> Task :com.fireytail.slevelmaker:generateDebugResValues
> Task :com.fireytail.slevelmaker:generateDebugResources
> Task :com.fireytail.slevelmaker:mergeDebugResources
> Task :com.fireytail.slevelmaker:createDebugCompatibleScreenManifests

> Task :com.fireytail.slevelmaker:processDebugManifest
U:\com.fireytail.slevelmaker\src\main\AndroidManifest.xml:30:3-84:17 Warning:
    application@android:label was tagged at AndroidManifest.xml:30 to replace other declarations but no other declaration present
U:\com.fireytail.slevelmaker\src\main\AndroidManifest.xml:31:5-40:16 Warning:
    activity#com.fireytail.slevelmaker.RunnerActivity@android:label was tagged at AndroidManifest.xml:31 to replace other declarations but no other declaration present
U:\com.fireytail.slevelmaker\src\main\AndroidManifest.xml:30:3-84:17 Warning:
    application@android:label was tagged at AndroidManifest.xml:30 to replace other declarations but no other declaration present
U:\com.fireytail.slevelmaker\src\main\AndroidManifest.xml:31:5-40:16 Warning:
    activity#com.fireytail.slevelmaker.RunnerActivity@android:label was tagged at AndroidManifest.xml:31 to replace other declarations but no other declaration present
U:\com.fireytail.slevelmaker\src\main\AndroidManifest.xml:30:3-84:17 Warning:
    application@android:label was tagged at AndroidManifest.xml:30 to replace other declarations but no other declaration present
U:\com.fireytail.slevelmaker\src\main\AndroidManifest.xml:31:5-40:16 Warning:
    activity#com.fireytail.slevelmaker.RunnerActivity@android:label was tagged at AndroidManifest.xml:31 to replace other declarations but no other declaration present
U:\com.fireytail.slevelmaker\src\main\AndroidManifest.xml:30:3-84:17 Warning:
    application@android:label was tagged at AndroidManifest.xml:30 to replace other declarations but no other declaration present
U:\com.fireytail.slevelmaker\src\main\AndroidManifest.xml:31:5-40:16 Warning:
    activity#com.fireytail.slevelmaker.RunnerActivity@android:label was tagged at AndroidManifest.xml:31 to replace other declarations but no other declaration present
U:\com.fireytail.slevelmaker\src\main\AndroidManifest.xml:30:3-84:17 Warning:
    application@android:label was tagged at AndroidManifest.xml:30 to replace other declarations but no other declaration present
U:\com.fireytail.slevelmaker\src\main\AndroidManifest.xml:31:5-40:16 Warning:
    activity#com.fireytail.slevelmaker.RunnerActivity@android:label was tagged at AndroidManifest.xml:31 to replace other declarations but no other declaration present

> Task :com.fireytail.slevelmaker:processDebugResources

> Task :com.fireytail.slevelmaker:compileDebugJavaWithJavac FAILED
U:\com.fireytail.slevelmaker\src\main\java\com\fireytail\slevelmaker\BillingRequests\BillingRequest.java:8: error: package com.android.vending.billing does not exist
import com.android.vending.billing.IInAppBillingService;
                                  ^
U:\com.fireytail.slevelmaker\src\main\java\com\fireytail\slevelmaker\BillingRequests\BillingRequest.java:20: error: cannot find symbol
    abstract protected void run(IInAppBillingService billingService) throws RemoteException; 
                                ^
  symbol:   class IInAppBillingService
  location: class BillingRequest
U:\com.fireytail.slevelmaker\src\main\java\com\fireytail\slevelmaker\BillingRequests\GetPurchases.java:12: error: package com.android.vending.billing does not exist
import com.android.vending.billing.IInAppBillingService;
                                  ^
U:\com.fireytail.slevelmaker\src\main\java\com\fireytail\slevelmaker\BillingRequests\GetPurchases.java:19: error: cannot find symbol
    IRunnerBilling.IBillingCallback mCallback;
                  ^
  symbol:   class IBillingCallback
  location: class IRunnerBilling
U:\com.fireytail.slevelmaker\src\main\java\com\fireytail\slevelmaker\BillingRequests\GetPurchases.java:21: error: cannot find symbol
    public GetPurchases(IRunnerBilling.IBillingCallback callback)
                                      ^
  symbol:   class IBillingCallback
  location: class IRunnerBilling
U:\com.fireytail.slevelmaker\src\main\java\com\fireytail\slevelmaker\BillingRequests\GetPurchases.java:27: error: cannot find symbol
    protected void run(IInAppBillingService billingService) throws RemoteException
                       ^
  symbol:   class IInAppBillingService
  location: class GetPurchases
U:\com.fireytail.slevelmaker\src\main\java\com\fireytail\slevelmaker\BillingRequests\GetSkuDetails.java:13: error: package com.android.vending.billing does not exist
import com.android.vending.billing.IInAppBillingService;
                                  ^
U:\com.fireytail.slevelmaker\src\main\java\com\fireytail\slevelmaker\BillingRequests\GetSkuDetails.java:21: error: cannot find symbol
    IRunnerBilling.IBillingCallback mCallback;
                  ^
  symbol:   class IBillingCallback
  location: class IRunnerBilling
U:\com.fireytail.slevelmaker\src\main\java\com\fireytail\slevelmaker\BillingRequests\GetSkuDetails.java:23: error: cannot find symbol
    public GetSkuDetails(String[] productIds, IRunnerBilling.IBillingCallback callback)
                                                            ^
  symbol:   class IBillingCallback
  location: class IRunnerBilling
U:\com.fireytail.slevelmaker\src\main\java\com\fireytail\slevelmaker\BillingRequests\GetSkuDetails.java:30: error: cannot find symbol
    protected void run(IInAppBillingService billingService) throws RemoteException
                       ^
  symbol:   class IInAppBillingService
  location: class GetSkuDetails
U:\com.fireytail.slevelmaker\src\main\java\com\fireytail\slevelmaker\BillingRequests\RequestConsume.java:12: error: package com.android.vending.billing does not exist
import com.android.vending.billing.IInAppBillingService;
                                  ^
U:\com.fireytail.slevelmaker\src\main\java\com\fireytail\slevelmaker\BillingRequests\RequestConsume.java:20: error: cannot find symbol
    public final IRunnerBilling.IBillingCallback mCallback;
                               ^
  symbol:   class IBillingCallback
  location: class IRunnerBilling
U:\com.fireytail.slevelmaker\src\main\java\com\fireytail\slevelmaker\BillingRequests\RequestConsume.java:22: error: cannot find symbol
    public RequestConsume(String token, IRunnerBilling.IBillingCallback callback)
                                                      ^
  symbol:   class IBillingCallback
  location: class IRunnerBilling
U:\com.fireytail.slevelmaker\src\main\java\com\fireytail\slevelmaker\BillingRequests\RequestConsume.java:29: error: cannot find symbol
    protected void run(IInAppBillingService billingService) throws RemoteException
                       ^
  symbol:   class IInAppBillingService
  location: class RequestConsume
U:\com.fireytail.slevelmaker\src\main\java\com\fireytail\slevelmaker\BillingRequests\RequestPurchase.java:12: error: package com.android.vending.billing does not exist
import com.android.vending.billing.IInAppBillingService;
                                  ^
U:\com.fireytail.slevelmaker\src\main\java\com\fireytail\slevelmaker\BillingRequests\RequestPurchase.java:22: error: cannot find symbol
    public final IRunnerBilling.IBillingCallback mCallback;
                               ^
  symbol:   class IBillingCallback
  location: class IRunnerBilling
U:\com.fireytail.slevelmaker\src\main\java\com\fireytail\slevelmaker\BillingRequests\RequestPurchase.java:24: error: cannot find symbol
    public RequestPurchase(String productId, String developerPayload, int requestCode, IRunnerBilling.IBillingCallback callback)
                                                                                                     ^
  symbol:   class IBillingCallback
  location: class IRunnerBilling
U:\com.fireytail.slevelmaker\src\main\java\com\fireytail\slevelmaker\BillingRequests\RequestPurchase.java:33: error: cannot find symbol
    protected void run(IInAppBillingService billingService) throws RemoteException
                       ^
  symbol:   class IInAppBillingService
  location: class RequestPurchase
U:\com.fireytail.slevelmaker\src\main\java\com\fireytail\slevelmaker\GooglePlayServicesExtension.java:13: error: cannot find symbol
import android.support.v4.app.FragmentManager;
                             ^
  symbol:   class FragmentManager
  location: package android.support.v4.app
U:\com.fireytail.slevelmaker\src\main\java\com\fireytail\slevelmaker\GooglePlayServicesExtension.java:18: error: cannot find symbol
import android.support.v4.app.FragmentActivity;
                             ^
  symbol:   class FragmentActivity
  location: package android.support.v4.app
U:\com.fireytail.slevelmaker\src\main\java\com\fireytail\slevelmaker\RunnerBilling.java:24: error: package com.android.vending.billing does not exist
import com.android.vending.billing.IInAppBillingService;
                                  ^
U:\com.fireytail.slevelmaker\src\main\java\com\fireytail\slevelmaker\RunnerBilling.java:32: error: cannot find symbol
    private HashMap<Integer, PurchaseDetails> mPurchaseRequests = new HashMap<Integer, PurchaseDetails>(); 
                             ^
  symbol:   class PurchaseDetails
  location: class RunnerBilling
U:\com.fireytail.slevelmaker\src\main\java\com\fireytail\slevelmaker\RunnerBillingService.java:24: error: package com.android.vending.billing does not exist
import com.android.vending.billing.IInAppBillingService;
                                  ^
U:\com.fireytail.slevelmaker\src\main\java\com\fireytail\slevelmaker\RunnerBilling.java:143: error: cannot find symbol
    private void RetrieveSkuDetails(String[] _productIds, IBillingCallback _callback)
                                                          ^
  symbol:   class IBillingCallback
  location: class RunnerBilling
U:\com.fireytail.slevelmaker\src\main\java\com\fireytail\slevelmaker\RunnerBilling.java:178: error: cannot find symbol
    private void RetrievePurchases(IBillingCallback _callback)
                                   ^
  symbol:   class IBillingCallback
  location: class RunnerBilling
U:\com.fireytail.slevelmaker\src\main\java\com\fireytail\slevelmaker\RunnerBillingService.java:30: error: cannot find symbol
    private IInAppBillingService mService = null;
            ^
  symbol:   class IInAppBillingService
  location: class RunnerBillingService
U:\com.fireytail.slevelmaker\src\main\java\com\fireytail\slevelmaker\RunnerBillingService.java:33: error: cannot find symbol
    private IRunnerBilling.IBillingCallback mServiceConnectedCallback = null;
                          ^
  symbol:   class IBillingCallback
  location: class IRunnerBilling
U:\com.fireytail.slevelmaker\src\main\java\com\fireytail\slevelmaker\RunnerBillingService.java:61: error: cannot find symbol
    public boolean bindToBillingService(IRunnerBilling.IBillingCallback _serviceConnectedCallback)
                                                      ^
  symbol:   class IBillingCallback
  location: class IRunnerBilling
U:\com.fireytail.slevelmaker\src\main\java\com\fireytail\slevelmaker\RunnerBillingService.java:202: error: cannot find symbol
    public boolean requestPurchase(String productId, String developerPayload, int requestCode, IRunnerBilling.IBillingCallback callback)
                                                                                                             ^
  symbol:   class IBillingCallback
  location: class IRunnerBilling
U:\com.fireytail.slevelmaker\src\main\java\com\fireytail\slevelmaker\RunnerBillingService.java:212: error: cannot find symbol
    public boolean requestConsume(String token, IRunnerBilling.IBillingCallback callback)
                                                              ^
  symbol:   class IBillingCallback
  location: class IRunnerBilling
U:\com.fireytail.slevelmaker\src\main\java\com\fireytail\slevelmaker\RunnerBillingService.java:224: error: cannot find symbol
    public boolean requestSkuDetails(String[] productIds, IRunnerBilling.IBillingCallback callback)
                                                                        ^
  symbol:   class IBillingCallback
  location: class IRunnerBilling
U:\com.fireytail.slevelmaker\src\main\java\com\fireytail\slevelmaker\RunnerBillingService.java:233: error: cannot find symbol
    public boolean requestPurchases(IRunnerBilling.IBillingCallback callback)
                                                  ^
  symbol:   class IBillingCallback
  location: class IRunnerBilling
U:\com.fireytail.slevelmaker\src\main\java\com\fireytail\slevelmaker\RunnerBilling.java:32: error: cannot find symbol
    private HashMap<Integer, PurchaseDetails> mPurchaseRequests = new HashMap<Integer, PurchaseDetails>(); 
                                                                                       ^
  symbol:   class PurchaseDetails
  location: class RunnerBilling
U:\com.fireytail.slevelmaker\src\main\java\com\fireytail\slevelmaker\RunnerBilling.java:104: error: cannot find symbol
        mBillingService.bindToBillingService(new IBillingCallback() {
                                                 ^
  symbol:   class IBillingCallback
  location: class RunnerBilling
U:\com.fireytail.slevelmaker\src\main\java\com\fireytail\slevelmaker\RunnerBilling.java:145: error: cannot find symbol
        final IBillingCallback callback = _callback;
              ^
  symbol:   class IBillingCallback
  location: class RunnerBilling
U:\com.fireytail.slevelmaker\src\main\java\com\fireytail\slevelmaker\RunnerBilling.java:147: error: cannot find symbol
        mBillingService.requestSkuDetails(_productIds, new IBillingCallback() {
                                                           ^
  symbol:   class IBillingCallback
  location: class RunnerBilling
U:\com.fireytail.slevelmaker\src\main\java\com\fireytail\slevelmaker\RunnerBilling.java:180: error: cannot find symbol
        final IBillingCallback callback = _callback;
              ^
  symbol:   class IBillingCallback
  location: class RunnerBilling
U:\com.fireytail.slevelmaker\src\main\java\com\fireytail\slevelmaker\RunnerBilling.java:182: error: cannot find symbol
        mBillingService.requestPurchases(new IBillingCallback() {
                                             ^
  symbol:   class IBillingCallback
  location: class RunnerBilling
U:\com.fireytail.slevelmaker\src\main\java\com\fireytail\slevelmaker\RunnerBilling.java:249: error: cannot find symbol
        RunnerJNILib.IAPRestoreEvent(0);
                    ^
  symbol:   method IAPRestoreEvent(int)
  location: class RunnerJNILib
U:\com.fireytail.slevelmaker\src\main\java\com\fireytail\slevelmaker\RunnerBilling.java:264: error: cannot find symbol
        mPurchaseRequests.put(Integer.valueOf(requestCode), new PurchaseDetails(_productId, _purchaseIndex));
                                                                ^
  symbol:   class PurchaseDetails
  location: class RunnerBilling
U:\com.fireytail.slevelmaker\src\main\java\com\fireytail\slevelmaker\RunnerBilling.java:270: error: cannot find symbol
            new IBillingCallback() {
                ^
  symbol:   class IBillingCallback
  location: class RunnerBilling
U:\com.fireytail.slevelmaker\src\main\java\com\fireytail\slevelmaker\RunnerBilling.java:300: error: cannot find symbol
            new IBillingCallback() {
                ^
  symbol:   class IBillingCallback
  location: class RunnerBilling
U:\com.fireytail.slevelmaker\src\main\java\com\fireytail\slevelmaker\RunnerBilling.java:360: error: cannot find symbol
        RetrieveSkuDetails(productIds, new IBillingCallback() {
                                           ^
  symbol:   class IBillingCallback
  location: class RunnerBilling
U:\com.fireytail.slevelmaker\src\main\java\com\fireytail\slevelmaker\RunnerBilling.java:383: error: cannot find symbol
        registerContentPurchased(purchaseId, true);
        ^
  symbol:   method registerContentPurchased(String,boolean)
  location: class RunnerBilling
U:\com.fireytail.slevelmaker\src\main\java\com\fireytail\slevelmaker\RunnerBilling.java:391: error: cannot find symbol
        return md5encode("yoyo_purchase_" + contentId + "_punky_juular");
               ^
  symbol:   method md5encode(String)
  location: class RunnerBilling
U:\com.fireytail.slevelmaker\src\main\java\com\fireytail\slevelmaker\RunnerBilling.java:398: error: method does not override or implement a method from a supertype
    @Override
    ^
U:\com.fireytail.slevelmaker\src\main\java\com\fireytail\slevelmaker\RunnerBilling.java:402: error: cannot find symbol
        PurchaseDetails purchaseDetails = mPurchaseRequests.get(Integer.valueOf(_requestCode));     
        ^
  symbol:   class PurchaseDetails
  location: class RunnerBilling
U:\com.fireytail.slevelmaker\src\main\java\com\fireytail\slevelmaker\RunnerBilling.java:448: error: cannot find symbol
                        RunnerJNILib.IAPProductPurchaseEvent(purchaseData);
                                    ^
  symbol:   method IAPProductPurchaseEvent(String)
  location: class RunnerJNILib
U:\com.fireytail.slevelmaker\src\main\java\com\fireytail\slevelmaker\RunnerBillingService.java:95: error: package IInAppBillingService does not exist
        mService = IInAppBillingService.Stub.asInterface(service);     
                                       ^
U:\com.fireytail.slevelmaker\src\main\java\com\fireytail\slevelmaker\RunnerBillingService.java:175: error: cannot find symbol
            final IInAppBillingService service = mService;
                  ^
  symbol:   class IInAppBillingService
  location: class RunnerBillingService
Note: Some input files use or override a deprecated API.
Note: Recompile with -Xlint:deprecation for details.
Note: U:\com.fireytail.slevelmaker\src\main\java\com\fireytail\slevelmaker\GooglePlayServicesExtension.java uses unchecked or unsafe operations.
Note: Recompile with -Xlint:unchecked for details.
50 errors

FAILURE: Build failed with an exception.

* What went wrong:
Execution failed for task ':com.fireytail.slevelmaker:compileDebugJavaWithJavac'.
> Compilation failed; see the compiler error output for details.

* Try:
Run with --stacktrace option to get the stack trace. Run with --info or --debug option to get more log output. Run with --scan to get full insights.

* Get more help at https://help.gradle.org

Deprecated Gradle features were used in this build, making it incompatible with Gradle 6.0.
Use '--warning-mode all' to show the individual deprecation warnings.
See https://docs.gradle.org/5.1.1/userguide/command_line_interface.html#sec:command_line_warnings

BUILD FAILED in 7s
23 actionable tasks: 21 executed, 2 up-to-date


C:\windows\system32\cmd.exe exited with non-zero status (1)
EDIT: Don't know why removing all extensions from my project didn't work before, because I just added the Google Play Services extension to a new empty project and it has the same problem. So as it is an issue with the beta, I guess I'll just have to downgrade then. Since I can't build AAB in non beta, I'm stuck with ios only.
 
Last edited:

chirpy

Member
I also had this issue (gms2 IDE 2.2.4.459, runtime 2.2.4.366). It seems that GooglePlayServicesIAPExtension is now deprecated and causing this kind of conflicts. It's also seen in your logs (extensions\GooglePlayServicesIAPExtension).
I deleted it and then downloaded GooglePlayServices 3.1.8 which includes GooglePlayBillingExtension from Game Options (middle-top gear button) -> Main Options -> Add-ons, and my build is now failing with other errors now (Edit: it's the redundant FragmentManager import; also later fixed by merging with latest 3.1.8 java code).

ref:
https://help.yoyogames.com/hc/en-us/articles/360031457831-Android-Google-Play-Billing-IAPs-

It's probably mentioned somewhere else in the forum; I'll put it here as my 2 cents.
 
Last edited:

sefi331

Member
Had a similar issue, not sure is the same, but what worked for me is to unchecked the "use --release option" in the Android studio

upload_2019-10-21_3-13-45.png
 
Top