• Hello [name]! Thanks for joining the GMC. Before making any posts in the Tech Support forum, can we suggest you read the forum rules? These are simple guidelines that we ask you to follow so that you can get the best help possible for your issue.

Android executable won't build

StarJune

Member
Hi, I have followed the given steps but still have the same problem: executable won't build. I uninstalled and reinstalled everything but nothing happens. Here are some screenshots of my different settings and my actual logs.

Edit : the device has Android 7.0 so I made some changes but I still have the same problem. I also noticed that with each build a local disk is generated.

GML:
"cmd"  /c subst Z: "C:\Users\HP 840 G2\AppData\Roaming\GameMakerStudio2\Cache\GMS2CACHE"

elapsed time 00:00:00.0989930s for command "cmd" /c subst Z: "C:\Users\HP 840 G2\AppData\Roaming\GameMakerStudio2\Cache\GMS2CACHE" started at 10/01/2021 20:24:37
"cmd"  /c subst Y: "C:\Users\HP 840 G2\AppData\Local\GameMakerStudio2\GMS2TEMP"

elapsed time 00:00:00.0969464s for command "cmd" /c subst Y: "C:\Users\HP 840 G2\AppData\Local\GameMakerStudio2\GMS2TEMP" started at 10/01/2021 20:24:37
"cmd"  /c subst X: "C:\ProgramData\GameMakerStudio2\Cache\runtimes\runtime-2.3.5.458"

elapsed time 00:00:00.1014753s for command "cmd" /c subst X: "C:\ProgramData\GameMakerStudio2\Cache\runtimes\runtime-2.3.5.458" started at 10/01/2021 20:24:37
"C:\ProgramData/GameMakerStudio2/Cache/runtimes\runtime-2.3.5.458/bin/Igor.exe"  -j=8 -options="C:\Users\HP 840 G2\AppData\Local\GameMakerStudio2\GMS2TEMP\build.bff" -v -- Android Run

Loaded Macros from C:\Users\HP 840 G2\AppData\Roaming\GameMakerStudio2\Cache\GMS2CACHE\BetaStarJu_DDC61ED8_87ABAC9A\macros.json
Options: X:/bin\platform_setting_defaults.json
Options: C:\Users\HP 840 G2\AppData\Roaming/GameMakerStudio2\ryan.laravine_2601033\local_settings.json
Options: C:\Users\HP 840 G2\AppData\Roaming\GameMakerStudio2\Cache\GMS2CACHE\BetaStarJu_DDC61ED8_87ABAC9A\targetoptions.json
Setting up the Asset compiler
X://bin/GMAssetCompiler.exe  /c /mv=1 /zpex /iv=0 /rv=0 /bv=0 /j=8  /gn="BetaStarJune" /td="Y:/" /cd="Z:/BetaStarJu_DDC61ED8_87ABAC9A" /zpuf="C:\Users\HP 840 G2\AppData\Roaming/GameMakerStudio2\ryan.laravine_2601033" /m=llvm-android /tgt=8 /llvmSource="X://yyc/"  /nodnd /cfg="Default" /fU="Z:/BetaStarJu_DDC61ED8_87ABAC9A\functionsUsed.txt" /o="Y:/BetaStarJune_20F64898_YYC" /optionsini="Y:/BetaStarJune_20F64898_YYC\options.ini" /baseproject="X:/BaseProject\BaseProject.yyp" "C:\Users\HP 840 G2\Desktop\BetaStarJune\BetaStarJune.yyp" /preprocess="Z:/BetaStarJu_DDC61ED8_87ABAC9A"
Found Project Format 2
ProjectFileWatcher:StartWatching:C:\Users\HP 840 G2\Desktop\BetaStarJune
Started: 01/10/2021 20:24:39
Finished: 01/10/2021 20:24:41
Diff: 00:00:01.4871471
Loaded Project: BetaStarJune
finished.
Release build
Options: Z:/BetaStarJu_DDC61ED8_87ABAC9A\ExtensionOptions.json
PlatformOptions
Options: Z:/BetaStarJu_DDC61ED8_87ABAC9A\PlatformOptions.json
Options: Z:/BetaStarJu_DDC61ED8_87ABAC9A\MainOptions.json
displayname
hostname
runtime
OptionsIni
PlatformOptions
X://bin/GMAssetCompiler.exe  /c /mv=1 /zpex /iv=0 /rv=0 /bv=0 /j=8  /gn="BetaStarJune" /td="Y:/" /cd="Z:/BetaStarJu_DDC61ED8_87ABAC9A" /zpuf="C:\Users\HP 840 G2\AppData\Roaming/GameMakerStudio2\ryan.laravine_2601033" /m=llvm-android /tgt=8 /llvmSource="X://yyc/"  /nodnd /cfg="Default" /fU="Z:/BetaStarJu_DDC61ED8_87ABAC9A\functionsUsed.txt" /o="Y:/BetaStarJune_20F64898_YYC" /optionsini="Y:/BetaStarJune_20F64898_YYC\options.ini" /baseproject="X:/BaseProject\BaseProject.yyp" "C:\Users\HP 840 G2\Desktop\BetaStarJune\BetaStarJune.yyp" /arch=54 /bt=exe /rt=yyc
Compile Constants...finished.
Remove DnD...finished.
Compile Scripts...finished.
Compile Rooms...finished.
Compile Objects...finished.
Compile Timelines...finished.
Compile Triggers...finished.
Compile Extensions...finished.
Global scripts...finished.
finished.
collapsing enums.
Final Compile...finished.
Writing Chunk... GEN8
option_game_speed=60
Writing Chunk... OPTN
Writing Chunk... LANG
Writing Chunk... EXTN
Writing Chunk... SOND
Writing Chunk... AGRP
Writing Chunk... SPRT
Writing Chunk... BGND
Writing Chunk... PATH
Writing Chunk... SCPT
Writing Chunk... GLOB
Writing Chunk... SHDR
Writing Chunk... FONT
Writing Chunk... TMLN
Writing Chunk... OBJT
Writing Chunk... ACRV
Writing Chunk... SEQN
Writing Chunk... TAGS
Writing Chunk... ROOM
Writing Chunk... DAFL
Writing Chunk... EMBI
Writing Chunk... TPAGE
Texture Group - Default
Writing Chunk... TGIN
Writing Chunk... STRG
Writing Chunk... TXTR
0 Compressing texture... writing texture texture_0.png...
Writing Chunk... AUDO
ClangExeLocation=C:\Android\sdk\ndk\22.1.7171670\toolchains\llvm\prebuilt\windows-x86_64\bin\clang++.exe
Using NDKDir = C:\Android\sdk\ndk\22.1.7171670
Using PlatformDir =
Using ARMToolChain = C:\Android\sdk\ndk\22.1.7171670\toolchains\arm-linux-androideabi-4.9\prebuilt\windows-x86_64
Using X86ToolChain = C:\Android\sdk\ndk\22.1.7171670\toolchains\x86-4.9\prebuilt\windows-x86_64
Using ARM64ToolChain = C:\Android\sdk\ndk\22.1.7171670\toolchains\aarch64-linux-android-4.9\prebuilt\windows-x86_64
Using X86_64ToolChain = C:\Android\sdk\ndk\22.1.7171670\toolchains\x86_64-4.9\prebuilt\windows-x86_64
saving file Y:/BetaStarJune_20F64898_YYC\BetaStarJune.droid
Android NDK: android-14 is unsupported. Using minimum supported version android-16.   
Android NDK: WARNING: APP_PLATFORM android-16 is higher than android:minSdkVersion 14 in ./AndroidManifest.xml. NDK binaries will *not* be compatible with devices older than android-16. See https://android.googlesource.com/platform/ndk/+/master/docs/user/common_problems.md for more information.   
fcntl(): Bad file descriptor
fcntl(): Bad file descriptor
[armeabi-v7a] Compile++ arm  : yoyo <= BetaStarJune.vars.cpp
[x86] Install        : libc++_shared.so => Y:/BetaStarJune_20F64898_YYC/lib/x86/libc++_shared.so
fcntl(): Bad file descriptor
[x86] Compile++      : yoyo <= BetaStarJune.vars.cpp
fcntl(): Bad file descriptor
[arm64-v8a] Install        : libc++_shared.so => Y:/BetaStarJune_20F64898_YYC/lib/arm64-v8a/libc++_shared.so
fcntl(): Bad file descriptor
[arm64-v8a] Compile++      : yoyo <= BetaStarJune.vars.cpp
fcntl(): Bad file descriptor
[x86_64] Compile++      : yoyo <= BetaStarJune.vars.cpp
fcntl(): Bad file descriptor
[armeabi-v7a] Install        : liboboe.so => Y:/BetaStarJune_20F64898_YYC/lib/armeabi-v7a/liboboe.so
fcntl(): Bad file descriptor
[armeabi-v7a] Install        : libc++_shared.so => Y:/BetaStarJune_20F64898_YYC/lib/armeabi-v7a/libc++_shared.so
fcntl(): Bad file descriptor
fcntl(): Bad file descriptor
[x86] Install        : liboboe.so => Y:/BetaStarJune_20F64898_YYC/lib/x86/liboboe.so
[arm64-v8a] Install        : liboboe.so => Y:/BetaStarJune_20F64898_YYC/lib/arm64-v8a/liboboe.so
fcntl(): Bad file descriptor
[x86_64] Install        : libc++_shared.so => Y:/BetaStarJune_20F64898_YYC/lib/x86_64/libc++_shared.so
fcntl(): Bad file descriptor
[x86_64] Install        : liboboe.so => Y:/BetaStarJune_20F64898_YYC/lib/x86_64/liboboe.so
fcntl(): Bad file descriptor
fcntl(): Bad file descriptor
[armeabi-v7a] SharedLibrary  : libyoyo.so
fcntl(): Bad file descriptor
[x86] SharedLibrary  : libyoyo.so
fcntl(): Bad file descriptor
[x86_64] SharedLibrary  : libyoyo.so
[armeabi-v7a] Install        : libyoyo.so => Y:/BetaStarJune_20F64898_YYC/lib/armeabi-v7a/libyoyo.so
fcntl(): Bad file descriptor
fcntl(): Bad file descriptor
[x86] Install        : libyoyo.so => Y:/BetaStarJune_20F64898_YYC/lib/x86/libyoyo.so
[arm64-v8a] SharedLibrary  : libyoyo.so
fcntl(): Bad file descriptor
[x86_64] Install        : libyoyo.so => Y:/BetaStarJune_20F64898_YYC/lib/x86_64/libyoyo.so
fcntl(): Bad file descriptor
[arm64-v8a] Install        : libyoyo.so => Y:/BetaStarJune_20F64898_YYC/lib/arm64-v8a/libyoyo.so
fcntl(): Bad file descriptor
Stats : GMA : Elapsed=5939,7657
Stats : GMA : sp=17,au=0,bk=0,pt=0,sc=5,sh=0,fo=1,tl=0,ob=15,ro=2,da=0,ex=0,ma=16,fm=0xA21428E80020
AndroidEnvironment
Manifest Permissions
Manifest Metadata
Check GML functions
Licensing
3
Copying X:/Android\runner\RootFiles\build.gradle to Z:/BetaStarJu_DDC61ED8_87ABAC9A\Android\Default\build.gradle...
Copying X:/Android\runner\RootFiles\gradle.properties to Z:/BetaStarJu_DDC61ED8_87ABAC9A\Android\Default\gradle.properties...
Copying X:/Android\runner\RootFiles\settings.gradle to Z:/BetaStarJu_DDC61ED8_87ABAC9A\Android\Default\settings.gradle...
59
Copying X:/Android\runner\ProjectFiles\build.gradle to Z:/BetaStarJu_DDC61ED8_87ABAC9A\Android\Default\com.company.game\build.gradle...
Copying X:/Android\runner\ProjectFiles\lint.xml to Z:/BetaStarJu_DDC61ED8_87ABAC9A\Android\Default\com.company.game\lint.xml...
Copying X:/Android\runner\ProjectFiles\libs\ini4j-0.5.2.jar to Z:/BetaStarJu_DDC61ED8_87ABAC9A\Android\Default\com.company.game\libs\ini4j-0.5.2.jar...
Copying X:/Android\runner\ProjectFiles\src\main\AndroidManifest.xml to Z:/BetaStarJu_DDC61ED8_87ABAC9A\Android\Default\com.company.game\src\main\AndroidManifest.xml...
Copying X:/Android\runner\ProjectFiles\src\main\assets\splash.png to Z:/BetaStarJu_DDC61ED8_87ABAC9A\Android\Default\com.company.game\src\main\assets\splash.png...
Copying X:/Android\runner\ProjectFiles\src\main\java\com\yoyogames\runner\RunnerJNILib.java to Z:/BetaStarJu_DDC61ED8_87ABAC9A\Android\Default\com.company.game\src\main\java\com\yoyogames\runner\RunnerJNILib.java...
Copying X:/Android\runner\ProjectFiles\src\main\java\YYAndroidPackageDomain\YYAndroidPackageCompany\YYAndroidPackageProduct\AdvertisingBase.java to Z:/BetaStarJu_DDC61ED8_87ABAC9A\Android\Default\com.company.game\src\main\java\com\company\game\AdvertisingBase.java...
Copying X:/Android\runner\ProjectFiles\src\main\java\YYAndroidPackageDomain\YYAndroidPackageCompany\YYAndroidPackageProduct\DemoGLSurfaceView.java to Z:/BetaStarJu_DDC61ED8_87ABAC9A\Android\Default\com.company.game\src\main\java\com\company\game\DemoGLSurfaceView.java...
Copying X:/Android\runner\ProjectFiles\src\main\java\YYAndroidPackageDomain\YYAndroidPackageCompany\YYAndroidPackageProduct\DemoRenderer.java to Z:/BetaStarJu_DDC61ED8_87ABAC9A\Android\Default\com.company.game\src\main\java\com\company\game\DemoRenderer.java...
Copying X:/Android\runner\ProjectFiles\src\main\java\YYAndroidPackageDomain\YYAndroidPackageCompany\YYAndroidPackageProduct\DemoRendererGL2.java to Z:/BetaStarJu_DDC61ED8_87ABAC9A\Android\Default\com.company.game\src\main\java\com\company\game\DemoRendererGL2.java...
Copying X:/Android\runner\ProjectFiles\src\main\java\YYAndroidPackageDomain\YYAndroidPackageCompany\YYAndroidPackageProduct\ExtensionBase.java to Z:/BetaStarJu_DDC61ED8_87ABAC9A\Android\Default\com.company.game\src\main\java\com\company\game\ExtensionBase.java...
Copying X:/Android\runner\ProjectFiles\src\main\java\YYAndroidPackageDomain\YYAndroidPackageCompany\YYAndroidPackageProduct\Gamepad.java to Z:/BetaStarJu_DDC61ED8_87ABAC9A\Android\Default\com.company.game\src\main\java\com\company\game\Gamepad.java...
Copying X:/Android\runner\ProjectFiles\src\main\java\YYAndroidPackageDomain\YYAndroidPackageCompany\YYAndroidPackageProduct\IAdExt.java to Z:/BetaStarJu_DDC61ED8_87ABAC9A\Android\Default\com.company.game\src\main\java\com\company\game\IAdExt.java...
Copying X:/Android\runner\ProjectFiles\src\main\java\YYAndroidPackageDomain\YYAndroidPackageCompany\YYAndroidPackageProduct\IAdvertising.java to Z:/BetaStarJu_DDC61ED8_87ABAC9A\Android\Default\com.company.game\src\main\java\com\company\game\IAdvertising.java...
Copying X:/Android\runner\ProjectFiles\src\main\java\YYAndroidPackageDomain\YYAndroidPackageCompany\YYAndroidPackageProduct\IExtensionBase.java to Z:/BetaStarJu_DDC61ED8_87ABAC9A\Android\Default\com.company.game\src\main\java\com\company\game\IExtensionBase.java...
Copying X:/Android\runner\ProjectFiles\src\main\java\YYAndroidPackageDomain\YYAndroidPackageCompany\YYAndroidPackageProduct\IniBundle.java to Z:/BetaStarJu_DDC61ED8_87ABAC9A\Android\Default\com.company.game\src\main\java\com\company\game\IniBundle.java...
Copying X:/Android\runner\ProjectFiles\src\main\java\YYAndroidPackageDomain\YYAndroidPackageCompany\YYAndroidPackageProduct\ISocial.java to Z:/BetaStarJu_DDC61ED8_87ABAC9A\Android\Default\com.company.game\src\main\java\com\company\game\ISocial.java...
Copying X:/Android\runner\ProjectFiles\src\main\java\YYAndroidPackageDomain\YYAndroidPackageCompany\YYAndroidPackageProduct\RunnerActivity.java to Z:/BetaStarJu_DDC61ED8_87ABAC9A\Android\Default\com.company.game\src\main\java\com\company\game\RunnerActivity.java...
Copying X:/Android\runner\ProjectFiles\src\main\java\YYAndroidPackageDomain\YYAndroidPackageCompany\YYAndroidPackageProduct\RunnerAdExt.java to Z:/BetaStarJu_DDC61ED8_87ABAC9A\Android\Default\com.company.game\src\main\java\com\company\game\RunnerAdExt.java...
Copying X:/Android\runner\ProjectFiles\src\main\java\YYAndroidPackageDomain\YYAndroidPackageCompany\YYAndroidPackageProduct\RunnerApplication.java to Z:/BetaStarJu_DDC61ED8_87ABAC9A\Android\Default\com.company.game\src\main\java\com\company\game\RunnerApplication.java...
Copying X:/Android\runner\ProjectFiles\src\main\java\YYAndroidPackageDomain\YYAndroidPackageCompany\YYAndroidPackageProduct\RunnerKeyboardController.java to Z:/BetaStarJu_DDC61ED8_87ABAC9A\Android\Default\com.company.game\src\main\java\com\company\game\RunnerKeyboardController.java...
Copying X:/Android\runner\ProjectFiles\src\main\java\YYAndroidPackageDomain\YYAndroidPackageCompany\YYAndroidPackageProduct\RunnerSocial.java to Z:/BetaStarJu_DDC61ED8_87ABAC9A\Android\Default\com.company.game\src\main\java\com\company\game\RunnerSocial.java...
Copying X:/Android\runner\ProjectFiles\src\main\java\YYAndroidPackageDomain\YYAndroidPackageCompany\YYAndroidPackageProduct\RunnerVsyncHandler.java to Z:/BetaStarJu_DDC61ED8_87ABAC9A\Android\Default\com.company.game\src\main\java\com\company\game\RunnerVsyncHandler.java...
Copying X:/Android\runner\ProjectFiles\src\main\java\YYAndroidPackageDomain\YYAndroidPackageCompany\YYAndroidPackageProduct\Purchases\IRunnerBilling.java to Z:/BetaStarJu_DDC61ED8_87ABAC9A\Android\Default\com.company.game\src\main\java\com\company\game\Purchases\IRunnerBilling.java...
Copying X:/Android\runner\ProjectFiles\src\main\java\YYAndroidPackageDomain\YYAndroidPackageCompany\YYAndroidPackageProduct\Purchases\Null\NullBilling.java to Z:/BetaStarJu_DDC61ED8_87ABAC9A\Android\Default\com.company.game\src\main\java\com\company\game\Purchases\Null\NullBilling.java...
Copying X:/Android\runner\ProjectFiles\src\main\jniLibs\arm64-v8a\libc++_shared.so to Z:/BetaStarJu_DDC61ED8_87ABAC9A\Android\Default\com.company.game\src\main\jniLibs\arm64-v8a\libc++_shared.so...
Copying X:/Android\runner\ProjectFiles\src\main\jniLibs\arm64-v8a\liboboe.so to Z:/BetaStarJu_DDC61ED8_87ABAC9A\Android\Default\com.company.game\src\main\jniLibs\arm64-v8a\liboboe.so...
Copying X:/Android\runner\ProjectFiles\src\main\jniLibs\arm64-v8a\libyoyo.so to Z:/BetaStarJu_DDC61ED8_87ABAC9A\Android\Default\com.company.game\src\main\jniLibs\arm64-v8a\libyoyo.so...
Copying X:/Android\runner\ProjectFiles\src\main\jniLibs\armeabi-v7a\libc++_shared.so to Z:/BetaStarJu_DDC61ED8_87ABAC9A\Android\Default\com.company.game\src\main\jniLibs\armeabi-v7a\libc++_shared.so...
Copying X:/Android\runner\ProjectFiles\src\main\jniLibs\armeabi-v7a\liboboe.so to Z:/BetaStarJu_DDC61ED8_87ABAC9A\Android\Default\com.company.game\src\main\jniLibs\armeabi-v7a\liboboe.so...
Copying X:/Android\runner\ProjectFiles\src\main\jniLibs\armeabi-v7a\libyoyo.so to Z:/BetaStarJu_DDC61ED8_87ABAC9A\Android\Default\com.company.game\src\main\jniLibs\armeabi-v7a\libyoyo.so...
Copying X:/Android\runner\ProjectFiles\src\main\jniLibs\x86\libc++_shared.so to Z:/BetaStarJu_DDC61ED8_87ABAC9A\Android\Default\com.company.game\src\main\jniLibs\x86\libc++_shared.so...
Copying X:/Android\runner\ProjectFiles\src\main\jniLibs\x86\liboboe.so to Z:/BetaStarJu_DDC61ED8_87ABAC9A\Android\Default\com.company.game\src\main\jniLibs\x86\liboboe.so...
Copying X:/Android\runner\ProjectFiles\src\main\jniLibs\x86\libyoyo.so to Z:/BetaStarJu_DDC61ED8_87ABAC9A\Android\Default\com.company.game\src\main\jniLibs\x86\libyoyo.so...
Copying X:/Android\runner\ProjectFiles\src\main\jniLibs\x86_64\libc++_shared.so to Z:/BetaStarJu_DDC61ED8_87ABAC9A\Android\Default\com.company.game\src\main\jniLibs\x86_64\libc++_shared.so...
Copying X:/Android\runner\ProjectFiles\src\main\jniLibs\x86_64\liboboe.so to Z:/BetaStarJu_DDC61ED8_87ABAC9A\Android\Default\com.company.game\src\main\jniLibs\x86_64\liboboe.so...
Copying X:/Android\runner\ProjectFiles\src\main\jniLibs\x86_64\libyoyo.so to Z:/BetaStarJu_DDC61ED8_87ABAC9A\Android\Default\com.company.game\src\main\jniLibs\x86_64\libyoyo.so...
Copying X:/Android\runner\ProjectFiles\src\main\res\drawable-hdpi\icon.png to Z:/BetaStarJu_DDC61ED8_87ABAC9A\Android\Default\com.company.game\src\main\res\drawable-hdpi\icon.png...
Copying X:/Android\runner\ProjectFiles\src\main\res\drawable-hdpi-v26\adaptive_bg.png to Z:/BetaStarJu_DDC61ED8_87ABAC9A\Android\Default\com.company.game\src\main\res\drawable-hdpi-v26\adaptive_bg.png...
Copying X:/Android\runner\ProjectFiles\src\main\res\drawable-hdpi-v26\adaptive_icon.png to Z:/BetaStarJu_DDC61ED8_87ABAC9A\Android\Default\com.company.game\src\main\res\drawable-hdpi-v26\adaptive_icon.png...
Copying X:/Android\runner\ProjectFiles\src\main\res\drawable-hdpi-v26\icon.xml to Z:/BetaStarJu_DDC61ED8_87ABAC9A\Android\Default\com.company.game\src\main\res\drawable-hdpi-v26\icon.xml...
Copying X:/Android\runner\ProjectFiles\src\main\res\drawable-ldpi-v26\adaptive_bg.png to Z:/BetaStarJu_DDC61ED8_87ABAC9A\Android\Default\com.company.game\src\main\res\drawable-ldpi-v26\adaptive_bg.png...
Copying X:/Android\runner\ProjectFiles\src\main\res\drawable-ldpi-v26\adaptive_icon.png to Z:/BetaStarJu_DDC61ED8_87ABAC9A\Android\Default\com.company.game\src\main\res\drawable-ldpi-v26\adaptive_icon.png...
Copying X:/Android\runner\ProjectFiles\src\main\res\drawable-ldpi-v26\icon.xml to Z:/BetaStarJu_DDC61ED8_87ABAC9A\Android\Default\com.company.game\src\main\res\drawable-ldpi-v26\icon.xml...
Copying X:/Android\runner\ProjectFiles\src\main\res\drawable-mdpi-v26\adaptive_bg.png to Z:/BetaStarJu_DDC61ED8_87ABAC9A\Android\Default\com.company.game\src\main\res\drawable-mdpi-v26\adaptive_bg.png...
Copying X:/Android\runner\ProjectFiles\src\main\res\drawable-mdpi-v26\adaptive_icon.png to Z:/BetaStarJu_DDC61ED8_87ABAC9A\Android\Default\com.company.game\src\main\res\drawable-mdpi-v26\adaptive_icon.png...
Copying X:/Android\runner\ProjectFiles\src\main\res\drawable-mdpi-v26\icon.xml to Z:/BetaStarJu_DDC61ED8_87ABAC9A\Android\Default\com.company.game\src\main\res\drawable-mdpi-v26\icon.xml...
Copying X:/Android\runner\ProjectFiles\src\main\res\drawable-xhdpi-v26\adaptive_bg.png to Z:/BetaStarJu_DDC61ED8_87ABAC9A\Android\Default\com.company.game\src\main\res\drawable-xhdpi-v26\adaptive_bg.png...
Copying X:/Android\runner\ProjectFiles\src\main\res\drawable-xhdpi-v26\adaptive_icon.png to Z:/BetaStarJu_DDC61ED8_87ABAC9A\Android\Default\com.company.game\src\main\res\drawable-xhdpi-v26\adaptive_icon.png...
Copying X:/Android\runner\ProjectFiles\src\main\res\drawable-xhdpi-v26\icon.xml to Z:/BetaStarJu_DDC61ED8_87ABAC9A\Android\Default\com.company.game\src\main\res\drawable-xhdpi-v26\icon.xml...
Copying X:/Android\runner\ProjectFiles\src\main\res\drawable-xxhdpi-v26\adaptive_bg.png to Z:/BetaStarJu_DDC61ED8_87ABAC9A\Android\Default\com.company.game\src\main\res\drawable-xxhdpi-v26\adaptive_bg.png...
Copying X:/Android\runner\ProjectFiles\src\main\res\drawable-xxhdpi-v26\adaptive_icon.png to Z:/BetaStarJu_DDC61ED8_87ABAC9A\Android\Default\com.company.game\src\main\res\drawable-xxhdpi-v26\adaptive_icon.png...
Copying X:/Android\runner\ProjectFiles\src\main\res\drawable-xxhdpi-v26\icon.xml to Z:/BetaStarJu_DDC61ED8_87ABAC9A\Android\Default\com.company.game\src\main\res\drawable-xxhdpi-v26\icon.xml...
Copying X:/Android\runner\ProjectFiles\src\main\res\drawable-xxxhdpi-v26\adaptive_bg.png to Z:/BetaStarJu_DDC61ED8_87ABAC9A\Android\Default\com.company.game\src\main\res\drawable-xxxhdpi-v26\adaptive_bg.png...
Copying X:/Android\runner\ProjectFiles\src\main\res\drawable-xxxhdpi-v26\adaptive_icon.png to Z:/BetaStarJu_DDC61ED8_87ABAC9A\Android\Default\com.company.game\src\main\res\drawable-xxxhdpi-v26\adaptive_icon.png...
Copying X:/Android\runner\ProjectFiles\src\main\res\drawable-xxxhdpi-v26\icon.xml to Z:/BetaStarJu_DDC61ED8_87ABAC9A\Android\Default\com.company.game\src\main\res\drawable-xxxhdpi-v26\icon.xml...
Copying X:/Android\runner\ProjectFiles\src\main\res\layout\main.xml to Z:/BetaStarJu_DDC61ED8_87ABAC9A\Android\Default\com.company.game\src\main\res\layout\main.xml...
Copying X:/Android\runner\ProjectFiles\src\main\res\layout\userpasslayout.xml to Z:/BetaStarJu_DDC61ED8_87ABAC9A\Android\Default\com.company.game\src\main\res\layout\userpasslayout.xml...
Copying X:/Android\runner\ProjectFiles\src\main\res\values\strings.xml to Z:/BetaStarJu_DDC61ED8_87ABAC9A\Android\Default\com.company.game\src\main\res\values\strings.xml...
DoSplash
DoIcon
C:\WINDOWS\system32\cmd.exe /c "subst U: "Z:/BetaStarJu_DDC61ED8_87ABAC9A\Android\Default" && U: && cd "com.company.game" && "X:/Android\runner\gradle\gradlew" build  assembleRelease  lint  "
Warning: Mapping new ns http://schemas.android.com/repository/android/common/02 to old ns http://schemas.android.com/repository/android/common/01
Warning: Mapping new ns http://schemas.android.com/repository/android/generic/02 to old ns http://schemas.android.com/repository/android/generic/01
Warning: Mapping new ns http://schemas.android.com/sdk/android/repo/addon2/02 to old ns http://schemas.android.com/sdk/android/repo/addon2/01
Warning: Mapping new ns http://schemas.android.com/sdk/android/repo/repository2/02 to old ns http://schemas.android.com/sdk/android/repo/repository2/01
Warning: Mapping new ns http://schemas.android.com/sdk/android/repo/sys-img2/02 to old ns http://schemas.android.com/sdk/android/repo/sys-img2/01
> Task :com.company.game:preBuild UP-TO-DATE
> Task :com.company.game:preDebugBuild UP-TO-DATE
> Task :com.company.game:compileDebugAidl NO-SOURCE
> Task :com.company.game:generateDebugBuildConfig
> Task :com.company.game:compileDebugRenderscript NO-SOURCE
> Task :com.company.game:javaPreCompileDebug
> Task :com.company.game:generateDebugResValues
> Task :com.company.game:generateDebugResources
> Task :com.company.game:createDebugCompatibleScreenManifests
> Task :com.company.game:extractDeepLinksDebug

> Task :com.company.game:processDebugManifest
U:\com.company.game\src\main\AndroidManifest.xml:23:3-73:17 Warning:
    application@android:label was tagged at AndroidManifest.xml:23 to replace other declarations but no other declaration present
U:\com.company.game\src\main\AndroidManifest.xml:24:5-33:16 Warning:
    activity#com.company.game.RunnerActivity@android:label was tagged at AndroidManifest.xml:24 to replace other declarations but no other declaration present
U:\com.company.game\src\main\AndroidManifest.xml:23:3-73:17 Warning:
    application@android:label was tagged at AndroidManifest.xml:23 to replace other declarations but no other declaration present
U:\com.company.game\src\main\AndroidManifest.xml:24:5-33:16 Warning:
    activity#com.company.game.RunnerActivity@android:label was tagged at AndroidManifest.xml:24 to replace other declarations but no other declaration present
U:\com.company.game\src\main\AndroidManifest.xml:23:3-73:17 Warning:
    application@android:label was tagged at AndroidManifest.xml:23 to replace other declarations but no other declaration present
U:\com.company.game\src\main\AndroidManifest.xml:24:5-33:16 Warning:
    activity#com.company.game.RunnerActivity@android:label was tagged at AndroidManifest.xml:24 to replace other declarations but no other declaration present
U:\com.company.game\src\main\AndroidManifest.xml:23:3-73:17 Warning:
    application@android:label was tagged at AndroidManifest.xml:23 to replace other declarations but no other declaration present
U:\com.company.game\src\main\AndroidManifest.xml:24:5-33:16 Warning:
    activity#com.company.game.RunnerActivity@android:label was tagged at AndroidManifest.xml:24 to replace other declarations but no other declaration present
U:\com.company.game\src\main\AndroidManifest.xml:23:3-73:17 Warning:
    application@android:label was tagged at AndroidManifest.xml:23 to replace other declarations but no other declaration present
U:\com.company.game\src\main\AndroidManifest.xml:24:5-33:16 Warning:
    activity#com.company.game.RunnerActivity@android:label was tagged at AndroidManifest.xml:24 to replace other declarations but no other declaration present

> Task :com.company.game:mergeDebugResources
> Task :com.company.game:processDebugResources FAILED

FAILURE: Build failed with an exception.

* What went wrong:
Execution failed for task ':com.company.game:processDebugResources'.
> A failure occurred while executing com.android.build.gradle.internal.tasks.Workers$ActionFacade
   > Android resource linking failed
     C:\Users\HP 840 G2\.gradle\caches\transforms-2\files-2.1\bf96d2b5a86ecd602a621e7e96856420\appcompat-1.2.0\res\values-v26\values-v26.xml:5:5-8:13: AAPT: error: resource android:attr/colorError not found.
        
     C:\Users\HP 840 G2\.gradle\caches\transforms-2\files-2.1\bf96d2b5a86ecd602a621e7e96856420\appcompat-1.2.0\res\values-v26\values-v26.xml:9:5-12:13: AAPT: error: resource android:attr/colorError not found.
        
     C:\Users\HP 840 G2\.gradle\caches\transforms-2\files-2.1\bf96d2b5a86ecd602a621e7e96856420\appcompat-1.2.0\res\values-v26\values-v26.xml:13:5-16:13: AAPT: error: style attribute 'android:attr/keyboardNavigationCluster' not found.
        
     C:\Users\HP 840 G2\.gradle\caches\transforms-2\files-2.1\bf96d2b5a86ecd602a621e7e96856420\appcompat-1.2.0\res\values-v28\values-v28.xml:5:5-8:13: AAPT: error: resource android:attr/dialogCornerRadius not found.
        
     C:\Users\HP 840 G2\.gradle\caches\transforms-2\files-2.1\bf96d2b5a86ecd602a621e7e96856420\appcompat-1.2.0\res\values-v28\values-v28.xml:9:5-12:13: AAPT: error: resource android:attr/dialogCornerRadius not found.
        
     C:\Users\HP 840 G2\.gradle\caches\transforms-2\files-2.1\429fb715fcc7711d4ab133e350b6f531\core-1.3.0\res\values\values.xml:142:5-173:25: AAPT: error: resource android:attr/fontStyle not found.
        
     C:\Users\HP 840 G2\.gradle\caches\transforms-2\files-2.1\429fb715fcc7711d4ab133e350b6f531\core-1.3.0\res\values\values.xml:142:5-173:25: AAPT: error: resource android:attr/font not found.
        
     C:\Users\HP 840 G2\.gradle\caches\transforms-2\files-2.1\429fb715fcc7711d4ab133e350b6f531\core-1.3.0\res\values\values.xml:142:5-173:25: AAPT: error: resource android:attr/fontWeight not found.
        
     C:\Users\HP 840 G2\.gradle\caches\transforms-2\files-2.1\429fb715fcc7711d4ab133e350b6f531\core-1.3.0\res\values\values.xml:142:5-173:25: AAPT: error: resource android:attr/fontVariationSettings not found.
        
     C:\Users\HP 840 G2\.gradle\caches\transforms-2\files-2.1\429fb715fcc7711d4ab133e350b6f531\core-1.3.0\res\values\values.xml:142:5-173:25: AAPT: error: resource android:attr/ttcIndex not found.
        
     C:\Users\HP 840 G2\.gradle\caches\transforms-2\files-2.1\bf96d2b5a86ecd602a621e7e96856420\appcompat-1.2.0\res\values\values.xml:2771:5-2794:25: AAPT: error: resource android:attr/textFontWeight not found.
        

* Try:
Run with --stacktrace option to get the stack trace. Run with --info or --debug option to get more log output. Run with --scan to get full insights.

* Get more help at https://help.gradle.org

BUILD FAILED in 13s
8 actionable tasks: 8 executed


C:\WINDOWS\system32\cmd.exe exited with non-zero status (1)
elapsed time 00:00:26.1594035s for command "C:\ProgramData/GameMakerStudio2/Cache/runtimes\runtime-2.3.5.458/bin/Igor.exe" -j=8 -options="C:\Users\HP 840 G2\AppData\Local\GameMakerStudio2\GMS2TEMP\build.bff" -v -- Android Run started at 10/01/2021 20:24:37
"cmd"  /c subst Z: /d

elapsed time 00:00:00.1468783s for command "cmd" /c subst Z: /d started at 10/01/2021 20:25:03
"cmd"  /c subst Y: /d

elapsed time 00:00:00.1049388s for command "cmd" /c subst Y: /d started at 10/01/2021 20:25:04
"cmd"  /c subst X: /d

elapsed time 00:00:00.0939426s for command "cmd" /c subst X: /d started at 10/01/2021 20:25:04
FAILED: Run Program Complete
For the details of why this build failed, please review the whole log above and also see your Compile Errors window
 

Attachments

Last edited:

StarJune

Member
After several times checks I think it is a problem of locations or a lack of resources but I do not know what exactly. o_O
 

Fiersking

Member
i had the same problem it was the sdk version i give you mine just to be sure :

api level 30
ndk : 22.1.7171670

be sdur in android studio that you have downloaded the sdk for api30 and then shoose the exact sdk i mentioned.

everything should be fine after that.
 
I'm having the same issue.

Done all of this but still not working.

i had the same problem it was the sdk version i give you mine just to be sure :

api level 30
ndk : 22.1.7171670

be sdur in android studio that you have downloaded the sdk for api30 and then shoose the exact sdk i mentioned.

everything should be fine after that.
 

StarJune

Member
i had the same issue in an extrem way to solve it i had uninstall both gamemaker studio and android studio find and erase all stuff from android and game maker then reinstall all.
I did the same operation as you but unfortunately I still have the same messages. Honestly, I don't know what to do anymore ...
When I run the game on the device, it automatically creates local discs with existing files. I conclude that he is trying to make up for the lack of resources, but why? I installed the latest versions of GM2 and Android Studio.
Thanks for your help, I will keep looking.
 
Hey guys,
I'm not sure if this is the same issue which I've been struggling with, but maybe it will help you... I've been unable to build Android versions on one PC for quite some time too, and only today did I find what the problem could have been - my Android Studio version was too new!

You see - the Setting Up For Android page specifically tells you to go and download the latest version of Android Studio... But then on GMS2 Required SDKs page, you will read that "4.3 is not officially supported by any GMS2 release" - but that is the latest version of Android Studio you will always get automatically from https://developer.android.com/studio. To make it even more confusing, Google has changed the versioning on Android Studio, so instead of 4.2 etc., you now have 2020.3.1 as the latest version - so it's kind of hard to even know that you're actually using a wrong version.

Long story short - uninstall your Android Studio, but then do NOT install the latest official version - get an older one instead. I'm still not sure if 4.2.2 will work or not, so maybe if you want to make sure, go for 4.2.0. Luckily, all the old versions of Android Studio can be found here - look for 4.2.* versions there (they're not too old anyway - 4.2.0 only came out in May) and then make sure never to update your Android Studio version again :D

Hope that helps šŸ¤ž
 

rIKmAN

Member
I'm still not sure if 4.2.2 will work or not
4.2.2 works fine, I set Android up from scratch recently on a new machine using it and had no issues.
All the details of the versions of everything I used can be found in this post.

Most people have issues with Android because they insist they have followed the guides to the letter but have usually missed something and end up using the wrong version of something or other and have problems.
 
I got it working in the end.
I uninstalled Andriod Studio and re-installed version 4.1.
I folled the instructions for setting up Andriod again and now I can deploy to my phone / tablet
 

StarJune

Member
Hey guys,
I'm not sure if this is the same issue which I've been struggling with, but maybe it will help you... I've been unable to build Android versions on one PC for quite some time too, and only today did I find what the problem could have been - my Android Studio version was too new!

You see - the Setting Up For Android page specifically tells you to go and download the latest version of Android Studio... But then on GMS2 Required SDKs page, you will read that "4.3 is not officially supported by any GMS2 release" - but that is the latest version of Android Studio you will always get automatically from https://developer.android.com/studio. To make it even more confusing, Google has changed the versioning on Android Studio, so instead of 4.2 etc., you now have 2020.3.1 as the latest version - so it's kind of hard to even know that you're actually using a wrong version.

Long story short - uninstall your Android Studio, but then do NOT install the latest official version - get an older one instead. I'm still not sure if 4.2.2 will work or not, so maybe if you want to make sure, go for 4.2.0. Luckily, all the old versions of Android Studio can be found here - look for 4.2.* versions there (they're not too old anyway - 4.2.0 only came out in May) and then make sure never to update your Android Studio version again :D

Hope that helps šŸ¤ž
That was the problem. Thank you I can finally run the game on my device.
:)
 
Top