• Hello [name]! Thanks for joining the GMC. Before making any posts in the Tech Support forum, can we suggest you read the forum rules? These are simple guidelines that we ask you to follow so that you can get the best help possible for your issue.

Android Android Keystore problem?

Hi guys, I get this error and I tried to correct it in many ways and I cannot make it disappear. Please help

FAILURE: Build failed with an exception.

* What went wrong:
Execution failed for task ':com.yoshua.game:packageRelease'.
> 1 exception was raised by workers:
  java.lang.RuntimeException: java.lang.RuntimeException: com.android.ide.common.signing.KeytoolException: Failed to read key Shiny from store "C:\Users\yoshu\OneDrive\Documentos\GameMakerStudio2\Orygon\Orygon.keystore": Keystore was tampered with, or password was incorrect

* Try:
Run with --stacktrace option to get the stack trace. Run with --info or --debug option to get more log output. Run with --scan to get full insights.

* Get more help at https://help.gradle.org

Deprecated Gradle features were used in this build, making it incompatible with Gradle 6.0.
Use '--warning-mode all' to show the individual deprecation warnings.
See https://docs.gradle.org/5.1.1/userguide/command_line_interface.html#sec:command_line_warnings

50 actionable tasks: 5 executed, 45 up-to-date

C:\WINDOWS\system32\cmd.exe DONE (1)
C:\WINDOWS\system32\subst.exe /d V:

C:\WINDOWS\system32\subst.exe DONE (0)
Error : Build Failed
Igor complete.