• Hello [name]! Thanks for joining the GMC. Before making any posts in the Tech Support forum, can we suggest you read the forum rules? These are simple guidelines that we ask you to follow so that you can get the best help possible for your issue.

Android / Amazon Fire Android Compile Problem

Groster

Member
A similar problem.
I just compiled an example from YOE for an example.
It also gives an error "NDK out" in CMD ...
I tried different versions of NDK and SDK, nothing helps (

P.s.:The latest version of the program. 2.2.5

Problem code.

Code:
Saving project to: C:\Users\Groster\Documents\GameMakerStudio2\YoYo Dungeon\YoYo Dungeon.yyp
"cmd"  /c subst Z: "C:\Users\Groster\AppData\Roaming\GameMakerStudio2\Cache\GMS2CACHE"

elapsed time 00:00:00.0670039s for command "cmd" /c subst Z: "C:\Users\Groster\AppData\Roaming\GameMakerStudio2\Cache\GMS2CACHE" started at 06/01/2020 16:41:07
"cmd"  /c subst Y: "C:\Users\Groster\AppData\Local\GameMakerStudio2\GMS2TEMP"

elapsed time 00:00:00.0660038s for command "cmd" /c subst Y: "C:\Users\Groster\AppData\Local\GameMakerStudio2\GMS2TEMP" started at 06/01/2020 16:41:07
"cmd"  /c subst X: "C:\ProgramData\GameMakerStudio2\Cache\runtimes\runtime-2.2.5.378"

elapsed time 00:00:00.0450026s for command "cmd" /c subst X: "C:\ProgramData\GameMakerStudio2\Cache\runtimes\runtime-2.2.5.378" started at 06/01/2020 16:41:07
"C:\ProgramData/GameMakerStudio2/Cache/runtimes\runtime-2.2.5.378/bin/Igor.exe"  -j=8 -options="C:\Users\Groster\AppData\Local\GameMakerStudio2\GMS2TEMP\build.bff" -v -- Android Package

Loaded Macros from C:\Users\Groster\AppData\Roaming\GameMakerStudio2\Cache\GMS2CACHE\YoYo_Dunge_79CC1CC_42BFA85B\macros.json
Options: X:/bin\platform_setting_defaults.json
Options: C:\Users\Groster\AppData\Roaming/GameMakerStudio2\yuriarmiuser_2000745\local_settings.json
Options: C:\Users\Groster\AppData\Roaming\GameMakerStudio2\Cache\GMS2CACHE\YoYo_Dunge_79CC1CC_42BFA85B\targetoptions.json
X://bin/GMAssetCompiler.exe  /c /zpex /iv=0 /rv=0 /bv=0 /j=8  /gn="YoYo Dungeon" /td="Y:/" /cd="Z:/YoYo_Dunge_79CC1CC_42BFA85B" /zpuf="C:\Users\Groster\AppData\Roaming/GameMakerStudio2\yuriarmiuser_2000745" /m=llvm-android /tgt=8 /llvmSource="X://yyc/"  /nodnd /cfg="default" /fU="Z:/YoYo_Dunge_79CC1CC_42BFA85B\functionsUsed.txt" /o="Y:/YoYo_Dungeon_1CCF494A_YYC" /optionsini="Y:/YoYo_Dungeon_1CCF494A_YYC\options.ini" /baseproject="X:/BaseProject\BaseProject.yyp" "C:\Users\Groster\Documents\GameMakerStudio2\YoYo Dungeon\YoYo Dungeon.yyp" /preprocess="Z:/YoYo_Dunge_79CC1CC_42BFA85B"
Reading project file....C:\Users\Groster\Documents\GameMakerStudio2\YoYo Dungeon
Reading project file....X:\BaseProject
Reading config delta 'C:\Users\Groster\Documents\GameMakerStudio2\YoYo Dungeon\options\main\inherited\options_main.inherited.yy'
finished.


X://bin/GMAssetCompiler.exe DONE (0)
Release build
Options: Z:/YoYo_Dunge_79CC1CC_42BFA85B\ExtensionOptions.json
PlatformOptions
Options: Z:/YoYo_Dunge_79CC1CC_42BFA85B\PlatformOptions.json
Options: Z:/YoYo_Dunge_79CC1CC_42BFA85B\MainOptions.json
runtime
OptionsIni
PlatformOptions
X://bin/GMAssetCompiler.exe  /c /zpex /iv=0 /rv=0 /bv=0 /j=8  /gn="YoYo Dungeon" /td="Y:/" /cd="Z:/YoYo_Dunge_79CC1CC_42BFA85B" /zpuf="C:\Users\Groster\AppData\Roaming/GameMakerStudio2\yuriarmiuser_2000745" /m=llvm-android /tgt=8 /llvmSource="X://yyc/"  /nodnd /cfg="default" /fU="Z:/YoYo_Dunge_79CC1CC_42BFA85B\functionsUsed.txt" /o="Y:/YoYo_Dungeon_1CCF494A_YYC" /optionsini="Y:/YoYo_Dungeon_1CCF494A_YYC\options.ini" /baseproject="X:/BaseProject\BaseProject.yyp" "C:\Users\Groster\Documents\GameMakerStudio2\YoYo Dungeon\YoYo Dungeon.yyp" /arch=4 /bt=exe /rt=yyc
Reading project file....C:\Users\Groster\Documents\GameMakerStudio2\YoYo Dungeon
Reading project file....X:\BaseProject
Reading config delta 'C:\Users\Groster\Documents\GameMakerStudio2\YoYo Dungeon\options\main\inherited\options_main.inherited.yy'
finished.
Compile Constants...finished.
Remove DnD...finished.
Compile Scripts...finished.
Compile Objects...finished.
Compile Timelines...finished.
Compile Triggers...finished.
Compile Rooms...finished.
Compile Extensions...finished.
Global scripts...finished.
finished.
collapsing enums.
Final Compile...finished.
Writing Chunk... GEN8
option_game_speed=60
Writing Chunk... OPTN
Writing Chunk... LANG
Writing Chunk... EXTN
Writing Chunk... SOND
Writing Chunk... AGRP
Writing Chunk... SPRT
Writing Chunk... BGND
Writing Chunk... PATH
Writing Chunk... SCPT
Writing Chunk... GLOB
Writing Chunk... SHDR
Writing Chunk... FONT
Writing Chunk... TMLN
Writing Chunk... OBJT
Writing Chunk... ROOM
Writing Chunk... DAFL
Writing Chunk... EMBI
Writing Chunk... TPAGE
Texture Group - Default
Writing Chunk... TGIN
Writing Chunk... STRG
Writing Chunk... TXTR
0 Compressing texture... writing texture texture_0.png...
1 Compressing texture... writing texture texture_1.png...
Writing Chunk... AUDO
ClangExeLocation=C:\SDK\ndk\21.0.6113669\toolchains\llvm\prebuilt\windows-x86_64\bin\clang++.exe
Using NDKDir = C:\SDK\ndk\21.0.6113669
Using PlatformDir = C:\SDK\ndk\21.0.6113669\platforms\android-29
Using X86ToolChain = C:\SDK\ndk\21.0.6113669\toolchains\x86-4.9\prebuilt\windows-x86_64
saving file Y:/YoYo_Dungeon_1CCF494A_YYC\YoYo Dungeon.droid
Z:\YoYo_Dunge_79CC1CC_42BFA85B\YoYo Dungeon\default\Scripts\llvm-android>start /w cmd.exe /v:on /c "call ndk.bat"
Z:\YoYo_Dunge_79CC1CC_42BFA85B\YoYo Dungeon\default\Scripts\llvm-android>type ndk.out
Android NDK: android-14 is unsupported. Using minimum supported version android-16.
Android NDK: WARNING: APP_PLATFORM android-16 is higher than android:minSdkVersion 14 in ./AndroidManifest.xml. NDK binaries will *not* be compatible with devices older than android-16. See https://android.googlesource.com/platform/ndk/+/master/docs/user/common_problems.md for more information.
[x86] Compile++      : yoyo <= gml_Script_debug.gml.cpp
[x86] Compile++      : yoyo <= gml_Script_AddObject.gml.cpp
[x86] Compile++      : yoyo <= gml_Script_InitMap.gml.cpp
[x86] Compile++      : yoyo <= gml_Script_OT_Create.gml.cpp
[x86] Compile++      : yoyo <= gml_Script_OT_Add.gml.cpp
[x86] Compile++      : yoyo <= gml_Script_OT_Reset.gml.cpp
[x86] Compile++      : yoyo <= gml_Script_OT_Draw_Silhouettes.gml.cpp
[x86] Compile++      : yoyo <= gml_Script_OT_Draw.gml.cpp
[x86] Compile++      : yoyo <= gml_Script_InitGlobals.gml.cpp
[x86] Compile++      : yoyo <= gml_Object_oAlcove_Alarm_0.gml.cpp
[x86] Compile++      : yoyo <= gml_Script_AddGamePad.gml.cpp
[x86] Compile++      : yoyo <= gml_Script_RemoveGamePad.gml.cpp
[x86] Compile++      : yoyo <= gml_Script_DoInput.gml.cpp
[x86] Compile++      : yoyo <= gml_Script_MovePlayer.gml.cpp
[x86] Compile++      : yoyo <= gml_Script_DoVirtualDPad.gml.cpp
[x86] Compile++      : yoyo <= gml_Object_oAlcove_Other_7.gml.cpp
[x86] Compile++      : yoyo <= gml_Object_oAlcove_PreCreate_0.gml.cpp
[x86] Compile++      : yoyo <= gml_Object_oChestEmpty_Create_0.gml.cpp
[x86] Compile++      : yoyo <= gml_Object_oChestEmpty_Draw_0.gml.cpp
[x86] Compile++      : yoyo <= gml_Object_oChestEmpty_PreCreate_0.gml.cpp
[x86] Compile++      : yoyo <= gml_Object_oChestFull_Draw_0.gml.cpp
[x86] Compile++      : yoyo <= gml_Object_oChestFull_Create_0.gml.cpp
[x86] Compile++      : yoyo <= gml_Script_ProcessCollision.gml.cpp
[x86] Compile++      : yoyo <= gml_Object_oChestFull_PreCreate_0.gml.cpp
[x86] Compile++      : yoyo <= gml_Object_oColumn_Create_0.gml.cpp
[x86] Compile++      : yoyo <= gml_Object_oColumn_Draw_0.gml.cpp
[x86] Compile++      : yoyo <= gml_Object_oDoor_Create_0.gml.cpp
[x86] Compile++      : yoyo <= gml_Object_oColumn_PreCreate_0.gml.cpp
[x86] Compile++      : yoyo <= gml_Object_oDoor_Draw_0.gml.cpp
[x86] Compile++      : yoyo <= gml_Object_oDoor_PreCreate_0.gml.cpp
[x86] Compile++      : yoyo <= gml_Object_oFloorSwitch_Create_0.gml.cpp
[x86] Compile++      : yoyo <= gml_Object_oFloorSwitch_Draw_0.gml.cpp
[x86] Compile++      : yoyo <= gml_Object_oFloorSwitch_PreCreate_0.gml.cpp
[x86] Compile++      : yoyo <= gml_Object_oLargeBarrel_Create_0.gml.cpp
[x86] Compile++      : yoyo <= gml_Object_oLargeBarrel_PreCreate_0.gml.cpp
[x86] Compile++      : yoyo <= gml_Object_oLargeBarrel_Draw_0.gml.cpp
[x86] Compile++      : yoyo <= gml_Object_oPortcullis_Create_0.gml.cpp
[x86] Compile++      : yoyo <= gml_Object_oPortcullis_Draw_0.gml.cpp
[x86] Compile++      : yoyo <= gml_Object_oPortcullis_PreCreate_0.gml.cpp
[x86] Compile++      : yoyo <= gml_Object_oSmallBarrel_Draw_0.gml.cpp
[x86] Compile++      : yoyo <= gml_Object_oSmallBarrel_Create_0.gml.cpp
[x86] Compile++      : yoyo <= gml_Object_oSmallBarrel_PreCreate_0.gml.cpp
[x86] Compile++      : yoyo <= gml_Object_oController_Step_1.gml.cpp
[x86] Compile++      : yoyo <= gml_Object_oController_PreCreate_0.gml.cpp
[x86] Compile++      : yoyo <= gml_Object_oController_Create_0.gml.cpp
[x86] Compile++      : yoyo <= gml_Object_oController_KeyPress_112.gml.cpp
[x86] Compile++      : yoyo <= gml_Object_oController_Draw_77.gml.cpp
[x86] Compile++      : yoyo <= gml_Object_oController_Draw_Draw_0.gml.cpp
[x86] Compile++      : yoyo <= gml_Object_oController_Draw_PreCreate_0.gml.cpp
[x86] Compile++      : yoyo <= gml_Object_oController_Lighting_Create_0.gml.cpp
[x86] Compile++      : yoyo <= gml_Object_oController_Silhouettes_Draw_0.gml.cpp
[x86] Compile++      : yoyo <= gml_Object_oController_Lighting_PreCreate_0.gml.cpp
[x86] Compile++      : yoyo <= gml_Object_oController_Silhouettes_PreCreate_0.gml.cpp
[x86] Compile++      : yoyo <= gml_Object_oController_Lighting_Draw_0.gml.cpp
[x86] Compile++      : yoyo <= gml_Object_oLargeBaddie_Create_0.gml.cpp
[x86] Compile++      : yoyo <= gml_Object_oLargeBaddie_Step_0.gml.cpp
[x86] Compile++      : yoyo <= gml_Object_oLargeBaddie_Draw_0.gml.cpp
[x86] Compile++      : yoyo <= gml_Object_oLargeBaddie_PreCreate_0.gml.cpp
[x86] Compile++      : yoyo <= gml_Object_oMaskBegin_Draw_0.gml.cpp
[x86] Compile++      : yoyo <= gml_Object_oMaskBegin_PreCreate_0.gml.cpp
[x86] Compile++      : yoyo <= gml_Object_oMaskEnd_PreCreate_0.gml.cpp
[x86] Compile++      : yoyo <= gml_Object_oMaskEnd_Draw_0.gml.cpp
[x86] Compile++      : yoyo <= gml_Object_oPlayer_Mouse_56.gml.cpp
[x86] Compile++      : yoyo <= gml_Object_oPlayer_Mouse_50.gml.cpp
[x86] Compile++      : yoyo <= gml_Object_oPlayer_Step_0.gml.cpp
[x86] Compile++      : yoyo <= gml_Object_oPlayer_Create_0.gml.cpp
[x86] Compile++      : yoyo <= gml_Object_oPlayer_Draw_0.gml.cpp
[x86] Compile++      : yoyo <= gml_Object_oPlayer_Other_75.gml.cpp
[x86] Compile++      : yoyo <= gml_Object_oPlayer_Draw_64.gml.cpp
[x86] Compile++      : yoyo <= gml_Object_oPlayer_PreCreate_0.gml.cpp
[x86] Compile++      : yoyo <= gml_Object_oBaddie_Draw_0.gml.cpp
[x86] Compile++      : yoyo <= gml_Object_oBaddie_Create_0.gml.cpp
[x86] Compile++      : yoyo <= gml_Object_oBaddie_Step_0.gml.cpp
[x86] Compile++      : yoyo <= gml_Object_oBaddie_PreCreate_0.gml.cpp
[x86] Prebuilt       : libc++_shared.so <= <NDK>/sources/cxx-stl/llvm-libc++/libs/x86/
[x86] Install        : libc++_shared.so => Y:/YoYo_Dungeon_1CCF494A_YYC/lib/x86/libc++_shared.so
[x86] Compile++      : yoyo <= gml_RoomCC_Dungeon_0_Create.gml.cpp
[x86] Compile++      : yoyo <= gml_RoomCC_Dungeon_2_Create.gml.cpp
[x86] Compile++      : yoyo <= gml_RoomCC_Dungeon_1_Create.gml.cpp
[x86] Compile++      : yoyo <= YoYo_Dungeon.vars.cpp
[x86] SharedLibrary  : libyoyo.so
[x86] Install        : libyoyo.so => Y:/YoYo_Dungeon_1CCF494A_YYC/lib/x86/libyoyo.so
Z:\YoYo_Dunge_79CC1CC_42BFA85B\YoYo Dungeon\default\Scripts\llvm-android>set /p exitcode= 0<exitcode.txt
Z:\YoYo_Dunge_79CC1CC_42BFA85B\YoYo Dungeon\default\Scripts\llvm-android>exit /b %exitcode%
Z:\YoYo_Dunge_79CC1CC_42BFA85B\YoYo Dungeon\default\Scripts\llvm-android>exit /b 0
Z:\YoYo_Dunge_79CC1CC_42BFA85B\YoYo Dungeon\default\Scripts\llvm-android>
Stats : GMA : Elapsed=8809,5038
Stats : GMA : sp=46,au=0,bk=2,pt=3,sc=15,sh=2,fo=1,tl=0,ob=18,ro=1,da=0,ex=0,ma=86,fm=0x400020052A0C02B4


X://bin/GMAssetCompiler.exe DONE (0)
AndroidEnvironment
Manifest Permissions
Manifest Metadata
Check GML functions
Licensing
3
Copying X:/Android\runner\RootFiles\build.gradle to Z:/YoYo_Dunge_79CC1CC_42BFA85B\Android\default\build.gradle...
Copying X:/Android\runner\RootFiles\gradle.properties to Z:/YoYo_Dunge_79CC1CC_42BFA85B\Android\default\gradle.properties...
Copying X:/Android\runner\RootFiles\settings.gradle to Z:/YoYo_Dunge_79CC1CC_42BFA85B\Android\default\settings.gradle...
59
Copying X:/Android\runner\ProjectFiles\build.gradle to Z:/YoYo_Dunge_79CC1CC_42BFA85B\Android\default\com.company.game\build.gradle...
Copying X:/Android\runner\ProjectFiles\lint.xml to Z:/YoYo_Dunge_79CC1CC_42BFA85B\Android\default\com.company.game\lint.xml...
Copying X:/Android\runner\ProjectFiles\libs\ini4j-0.5.2.jar to Z:/YoYo_Dunge_79CC1CC_42BFA85B\Android\default\com.company.game\libs\ini4j-0.5.2.jar...
Copying X:/Android\runner\ProjectFiles\libs\org.apache.http.legacy.jar to Z:/YoYo_Dunge_79CC1CC_42BFA85B\Android\default\com.company.game\libs\org.apache.http.legacy.jar...
Copying X:/Android\runner\ProjectFiles\src\main\AndroidManifest.xml to Z:/YoYo_Dunge_79CC1CC_42BFA85B\Android\default\com.company.game\src\main\AndroidManifest.xml...
Copying X:/Android\runner\ProjectFiles\src\main\assets\splash.png to Z:/YoYo_Dunge_79CC1CC_42BFA85B\Android\default\com.company.game\src\main\assets\splash.png...
Copying X:/Android\runner\ProjectFiles\src\main\java\com\yoyogames\runner\RunnerJNILib.java to Z:/YoYo_Dunge_79CC1CC_42BFA85B\Android\default\com.company.game\src\main\java\com\yoyogames\runner\RunnerJNILib.java...
Copying X:/Android\runner\ProjectFiles\src\main\java\YYAndroidPackageDomain\YYAndroidPackageCompany\YYAndroidPackageProduct\AdvertisingBase.java to Z:/YoYo_Dunge_79CC1CC_42BFA85B\Android\default\com.company.game\src\main\java\com\company\game\AdvertisingBase.java...
Copying X:/Android\runner\ProjectFiles\src\main\java\YYAndroidPackageDomain\YYAndroidPackageCompany\YYAndroidPackageProduct\DemoGLSurfaceView.java to Z:/YoYo_Dunge_79CC1CC_42BFA85B\Android\default\com.company.game\src\main\java\com\company\game\DemoGLSurfaceView.java...
Copying X:/Android\runner\ProjectFiles\src\main\java\YYAndroidPackageDomain\YYAndroidPackageCompany\YYAndroidPackageProduct\DemoRenderer.java to Z:/YoYo_Dunge_79CC1CC_42BFA85B\Android\default\com.company.game\src\main\java\com\company\game\DemoRenderer.java...
Copying X:/Android\runner\ProjectFiles\src\main\java\YYAndroidPackageDomain\YYAndroidPackageCompany\YYAndroidPackageProduct\DemoRendererGL2.java to Z:/YoYo_Dunge_79CC1CC_42BFA85B\Android\default\com.company.game\src\main\java\com\company\game\DemoRendererGL2.java...
Copying X:/Android\runner\ProjectFiles\src\main\java\YYAndroidPackageDomain\YYAndroidPackageCompany\YYAndroidPackageProduct\ExtensionBase.java to Z:/YoYo_Dunge_79CC1CC_42BFA85B\Android\default\com.company.game\src\main\java\com\company\game\ExtensionBase.java...
Copying X:/Android\runner\ProjectFiles\src\main\java\YYAndroidPackageDomain\YYAndroidPackageCompany\YYAndroidPackageProduct\IAdExt.java to Z:/YoYo_Dunge_79CC1CC_42BFA85B\Android\default\com.company.game\src\main\java\com\company\game\IAdExt.java...
Copying X:/Android\runner\ProjectFiles\src\main\java\YYAndroidPackageDomain\YYAndroidPackageCompany\YYAndroidPackageProduct\IAdvertising.java to Z:/YoYo_Dunge_79CC1CC_42BFA85B\Android\default\com.company.game\src\main\java\com\company\game\IAdvertising.java...
Copying X:/Android\runner\ProjectFiles\src\main\java\YYAndroidPackageDomain\YYAndroidPackageCompany\YYAndroidPackageProduct\IExtensionBase.java to Z:/YoYo_Dunge_79CC1CC_42BFA85B\Android\default\com.company.game\src\main\java\com\company\game\IExtensionBase.java...
Copying X:/Android\runner\ProjectFiles\src\main\java\YYAndroidPackageDomain\YYAndroidPackageCompany\YYAndroidPackageProduct\IniBundle.java to Z:/YoYo_Dunge_79CC1CC_42BFA85B\Android\default\com.company.game\src\main\java\com\company\game\IniBundle.java...
Copying X:/Android\runner\ProjectFiles\src\main\java\YYAndroidPackageDomain\YYAndroidPackageCompany\YYAndroidPackageProduct\ISocial.java to Z:/YoYo_Dunge_79CC1CC_42BFA85B\Android\default\com.company.game\src\main\java\com\company\game\ISocial.java...
Copying X:/Android\runner\ProjectFiles\src\main\java\YYAndroidPackageDomain\YYAndroidPackageCompany\YYAndroidPackageProduct\RunnerActivity.java to Z:/YoYo_Dunge_79CC1CC_42BFA85B\Android\default\com.company.game\src\main\java\com\company\game\RunnerActivity.java...
Copying X:/Android\runner\ProjectFiles\src\main\java\YYAndroidPackageDomain\YYAndroidPackageCompany\YYAndroidPackageProduct\RunnerAdExt.java to Z:/YoYo_Dunge_79CC1CC_42BFA85B\Android\default\com.company.game\src\main\java\com\company\game\RunnerAdExt.java...
Copying X:/Android\runner\ProjectFiles\src\main\java\YYAndroidPackageDomain\YYAndroidPackageCompany\YYAndroidPackageProduct\RunnerApplication.java to Z:/YoYo_Dunge_79CC1CC_42BFA85B\Android\default\com.company.game\src\main\java\com\company\game\RunnerApplication.java...
Copying X:/Android\runner\ProjectFiles\src\main\java\YYAndroidPackageDomain\YYAndroidPackageCompany\YYAndroidPackageProduct\RunnerKeyboardController.java to Z:/YoYo_Dunge_79CC1CC_42BFA85B\Android\default\com.company.game\src\main\java\com\company\game\RunnerKeyboardController.java...
Copying X:/Android\runner\ProjectFiles\src\main\java\YYAndroidPackageDomain\YYAndroidPackageCompany\YYAndroidPackageProduct\RunnerSocial.java to Z:/YoYo_Dunge_79CC1CC_42BFA85B\Android\default\com.company.game\src\main\java\com\company\game\RunnerSocial.java...
Copying X:/Android\runner\ProjectFiles\src\main\java\YYAndroidPackageDomain\YYAndroidPackageCompany\YYAndroidPackageProduct\RunnerVsyncHandler.java to Z:/YoYo_Dunge_79CC1CC_42BFA85B\Android\default\com.company.game\src\main\java\com\company\game\RunnerVsyncHandler.java...
Copying X:/Android\runner\ProjectFiles\src\main\java\YYAndroidPackageDomain\YYAndroidPackageCompany\YYAndroidPackageProduct\Gamepad\Gamepad.java to Z:/YoYo_Dunge_79CC1CC_42BFA85B\Android\default\com.company.game\src\main\java\com\company\game\Gamepad\Gamepad.java...
Copying X:/Android\runner\ProjectFiles\src\main\java\YYAndroidPackageDomain\YYAndroidPackageCompany\YYAndroidPackageProduct\Purchases\IRunnerBilling.java to Z:/YoYo_Dunge_79CC1CC_42BFA85B\Android\default\com.company.game\src\main\java\com\company\game\Purchases\IRunnerBilling.java...
Copying X:/Android\runner\ProjectFiles\src\main\java\YYAndroidPackageDomain\YYAndroidPackageCompany\YYAndroidPackageProduct\Purchases\Null\NullBilling.java to Z:/YoYo_Dunge_79CC1CC_42BFA85B\Android\default\com.company.game\src\main\java\com\company\game\Purchases\Null\NullBilling.java...
Copying X:/Android\runner\ProjectFiles\src\main\jniLibs\arm64-v8a\libc++_shared.so to Z:/YoYo_Dunge_79CC1CC_42BFA85B\Android\default\com.company.game\src\main\jniLibs\arm64-v8a\libc++_shared.so...
Copying X:/Android\runner\ProjectFiles\src\main\jniLibs\arm64-v8a\libyoyo.so to Z:/YoYo_Dunge_79CC1CC_42BFA85B\Android\default\com.company.game\src\main\jniLibs\arm64-v8a\libyoyo.so...
Copying X:/Android\runner\ProjectFiles\src\main\jniLibs\armeabi\libyoyo.so to Z:/YoYo_Dunge_79CC1CC_42BFA85B\Android\default\com.company.game\src\main\jniLibs\armeabi\libyoyo.so...
Copying X:/Android\runner\ProjectFiles\src\main\jniLibs\armeabi-v7a\libc++_shared.so to Z:/YoYo_Dunge_79CC1CC_42BFA85B\Android\default\com.company.game\src\main\jniLibs\armeabi-v7a\libc++_shared.so...
Copying X:/Android\runner\ProjectFiles\src\main\jniLibs\armeabi-v7a\libyoyo.so to Z:/YoYo_Dunge_79CC1CC_42BFA85B\Android\default\com.company.game\src\main\jniLibs\armeabi-v7a\libyoyo.so...
Copying X:/Android\runner\ProjectFiles\src\main\jniLibs\mips\libyoyo.so to Z:/YoYo_Dunge_79CC1CC_42BFA85B\Android\default\com.company.game\src\main\jniLibs\mips\libyoyo.so...
Copying X:/Android\runner\ProjectFiles\src\main\jniLibs\mips64\libyoyo.so to Z:/YoYo_Dunge_79CC1CC_42BFA85B\Android\default\com.company.game\src\main\jniLibs\mips64\libyoyo.so...
Copying X:/Android\runner\ProjectFiles\src\main\jniLibs\x86\libc++_shared.so to Z:/YoYo_Dunge_79CC1CC_42BFA85B\Android\default\com.company.game\src\main\jniLibs\x86\libc++_shared.so...
Copying X:/Android\runner\ProjectFiles\src\main\jniLibs\x86\libyoyo.so to Z:/YoYo_Dunge_79CC1CC_42BFA85B\Android\default\com.company.game\src\main\jniLibs\x86\libyoyo.so...
Copying X:/Android\runner\ProjectFiles\src\main\jniLibs\x86_64\libc++_shared.so to Z:/YoYo_Dunge_79CC1CC_42BFA85B\Android\default\com.company.game\src\main\jniLibs\x86_64\libc++_shared.so...
Copying X:/Android\runner\ProjectFiles\src\main\jniLibs\x86_64\libyoyo.so to Z:/YoYo_Dunge_79CC1CC_42BFA85B\Android\default\com.company.game\src\main\jniLibs\x86_64\libyoyo.so...
Copying X:/Android\runner\ProjectFiles\src\main\res\drawable-hdpi\icon.png to Z:/YoYo_Dunge_79CC1CC_42BFA85B\Android\default\com.company.game\src\main\res\drawable-hdpi\icon.png...
Copying X:/Android\runner\ProjectFiles\src\main\res\drawable-hdpi-v26\adaptive_bg.png to Z:/YoYo_Dunge_79CC1CC_42BFA85B\Android\default\com.company.game\src\main\res\drawable-hdpi-v26\adaptive_bg.png...
Copying X:/Android\runner\ProjectFiles\src\main\res\drawable-hdpi-v26\adaptive_icon.png to Z:/YoYo_Dunge_79CC1CC_42BFA85B\Android\default\com.company.game\src\main\res\drawable-hdpi-v26\adaptive_icon.png...
Copying X:/Android\runner\ProjectFiles\src\main\res\drawable-hdpi-v26\icon.xml to Z:/YoYo_Dunge_79CC1CC_42BFA85B\Android\default\com.company.game\src\main\res\drawable-hdpi-v26\icon.xml...
Copying X:/Android\runner\ProjectFiles\src\main\res\drawable-ldpi-v26\adaptive_bg.png to Z:/YoYo_Dunge_79CC1CC_42BFA85B\Android\default\com.company.game\src\main\res\drawable-ldpi-v26\adaptive_bg.png...
Copying X:/Android\runner\ProjectFiles\src\main\res\drawable-ldpi-v26\adaptive_icon.png to Z:/YoYo_Dunge_79CC1CC_42BFA85B\Android\default\com.company.game\src\main\res\drawable-ldpi-v26\adaptive_icon.png...
Copying X:/Android\runner\ProjectFiles\src\main\res\drawable-ldpi-v26\icon.xml to Z:/YoYo_Dunge_79CC1CC_42BFA85B\Android\default\com.company.game\src\main\res\drawable-ldpi-v26\icon.xml...
Copying X:/Android\runner\ProjectFiles\src\main\res\drawable-mdpi-v26\adaptive_bg.png to Z:/YoYo_Dunge_79CC1CC_42BFA85B\Android\default\com.company.game\src\main\res\drawable-mdpi-v26\adaptive_bg.png...
Copying X:/Android\runner\ProjectFiles\src\main\res\drawable-mdpi-v26\adaptive_icon.png to Z:/YoYo_Dunge_79CC1CC_42BFA85B\Android\default\com.company.game\src\main\res\drawable-mdpi-v26\adaptive_icon.png...
Copying X:/Android\runner\ProjectFiles\src\main\res\drawable-mdpi-v26\icon.xml to Z:/YoYo_Dunge_79CC1CC_42BFA85B\Android\default\com.company.game\src\main\res\drawable-mdpi-v26\icon.xml...
Copying X:/Android\runner\ProjectFiles\src\main\res\drawable-xhdpi-v26\adaptive_bg.png to Z:/YoYo_Dunge_79CC1CC_42BFA85B\Android\default\com.company.game\src\main\res\drawable-xhdpi-v26\adaptive_bg.png...
Copying X:/Android\runner\ProjectFiles\src\main\res\drawable-xhdpi-v26\adaptive_icon.png to Z:/YoYo_Dunge_79CC1CC_42BFA85B\Android\default\com.company.game\src\main\res\drawable-xhdpi-v26\adaptive_icon.png...
Copying X:/Android\runner\ProjectFiles\src\main\res\drawable-xhdpi-v26\icon.xml to Z:/YoYo_Dunge_79CC1CC_42BFA85B\Android\default\com.company.game\src\main\res\drawable-xhdpi-v26\icon.xml...
Copying X:/Android\runner\ProjectFiles\src\main\res\drawable-xxhdpi-v26\adaptive_bg.png to Z:/YoYo_Dunge_79CC1CC_42BFA85B\Android\default\com.company.game\src\main\res\drawable-xxhdpi-v26\adaptive_bg.png...
Copying X:/Android\runner\ProjectFiles\src\main\res\drawable-xxhdpi-v26\adaptive_icon.png to Z:/YoYo_Dunge_79CC1CC_42BFA85B\Android\default\com.company.game\src\main\res\drawable-xxhdpi-v26\adaptive_icon.png...
Copying X:/Android\runner\ProjectFiles\src\main\res\drawable-xxhdpi-v26\icon.xml to Z:/YoYo_Dunge_79CC1CC_42BFA85B\Android\default\com.company.game\src\main\res\drawable-xxhdpi-v26\icon.xml...
Copying X:/Android\runner\ProjectFiles\src\main\res\drawable-xxxhdpi-v26\adaptive_bg.png to Z:/YoYo_Dunge_79CC1CC_42BFA85B\Android\default\com.company.game\src\main\res\drawable-xxxhdpi-v26\adaptive_bg.png...
Copying X:/Android\runner\ProjectFiles\src\main\res\drawable-xxxhdpi-v26\adaptive_icon.png to Z:/YoYo_Dunge_79CC1CC_42BFA85B\Android\default\com.company.game\src\main\res\drawable-xxxhdpi-v26\adaptive_icon.png...
Copying X:/Android\runner\ProjectFiles\src\main\res\drawable-xxxhdpi-v26\icon.xml to Z:/YoYo_Dunge_79CC1CC_42BFA85B\Android\default\com.company.game\src\main\res\drawable-xxxhdpi-v26\icon.xml...
Copying X:/Android\runner\ProjectFiles\src\main\res\layout\main.xml to Z:/YoYo_Dunge_79CC1CC_42BFA85B\Android\default\com.company.game\src\main\res\layout\main.xml...
Copying X:/Android\runner\ProjectFiles\src\main\res\layout\userpasslayout.xml to Z:/YoYo_Dunge_79CC1CC_42BFA85B\Android\default\com.company.game\src\main\res\layout\userpasslayout.xml...
Copying X:/Android\runner\ProjectFiles\src\main\res\values\strings.xml to Z:/YoYo_Dunge_79CC1CC_42BFA85B\Android\default\com.company.game\src\main\res\values\strings.xml...
DoSplash
DoIcon
C:\Windows\system32\cmd.exe /c "subst V: "Z:/YoYo_Dunge_79CC1CC_42BFA85B\Android\default" && V: && cd "com.company.game" && "X:/Android\runner\gradle\gradlew" build  assembleRelease  -x lint  "
Exception in thread "DisconnectableInputStream source reader" org.gradle.api.UncheckedIOException: java.io.IOException: �������� ����������
    at org.gradle.internal.UncheckedException.throwAsUncheckedException(UncheckedException.java:61)
    at org.gradle.internal.UncheckedException.throwAsUncheckedException(UncheckedException.java:41)
    at org.gradle.util.DisconnectableInputStream$1.run(DisconnectableInputStream.java:125)
    at java.lang.Thread.run(Thread.java:748)
Caused by: java.io.IOException: �������� ����������
    at java.io.FileInputStream.readBytes(Native Method)
    at java.io.FileInputStream.read(FileInputStream.java:255)
    at java.io.BufferedInputStream.fill(BufferedInputStream.java:246)
    at java.io.BufferedInputStream.read1(BufferedInputStream.java:286)
    at java.io.BufferedInputStream.read(BufferedInputStream.java:345)
    at org.gradle.util.DisconnectableInputStream$1.run(DisconnectableInputStream.java:96)
    ... 1 more

FAILURE: Build failed with an exception.

* What went wrong:
Could not set process working directory to 'V:\com.company.game': could not set current directory (errno 3)

* Try:
Run with --stacktrace option to get the stack trace. Run with --info or --debug option to get more log output. Run with --scan to get full insights.

* Get more help at https://help.gradle.org


C:\Windows\system32\cmd.exe exited with non-zero status (1)
elapsed time 00:00:11.9516836s for command "C:\ProgramData/GameMakerStudio2/Cache/runtimes\runtime-2.2.5.378/bin/Igor.exe" -j=8 -options="C:\Users\Groster\AppData\Local\GameMakerStudio2\GMS2TEMP\build.bff" -v -- Android Package started at 06/01/2020 16:41:08
"cmd"  /c subst Z: /d

elapsed time 00:00:00.0420024s for command "cmd" /c subst Z: /d started at 06/01/2020 16:41:19
"cmd"  /c subst Y: /d

elapsed time 00:00:00.0440026s for command "cmd" /c subst Y: /d started at 06/01/2020 16:41:20
"cmd"  /c subst X: /d

elapsed time 00:00:00.0730041s for command "cmd" /c subst X: /d started at 06/01/2020 16:41:20
FAILED: Package Program Complete
For the details of why this build failed, please review the whole log above and also see your Compile Errors window.
 
Last edited by a moderator:

Groster

Member
Please, I really need help.
Because of this problem, the development of slack.
On top of that, I don't speak English well ._.
 

Groster

Member
Can you compile a fresh empty room project?
In fact, he has now compiled.
But this did not work, since this application is not installed on the phone.
The phone is Android 9.
The "NDK out" error in the command line remains.


aving project to: C:\Users\Groster\Documents\GameMakerStudio2\3333\3333.yyp
"cmd" /c subst Z: "C:\Users\Groster\AppData\Roaming\GameMakerStudio2\Cache\GMS2CACHE"

elapsed time 00:00:00.0840048s for command "cmd" /c subst Z: "C:\Users\Groster\AppData\Roaming\GameMakerStudio2\Cache\GMS2CACHE" started at 06/07/2020 03:42:03
"cmd" /c subst Y: "C:\Users\Groster\AppData\Local\GameMakerStudio2\GMS2TEMP"

elapsed time 00:00:00.0760044s for command "cmd" /c subst Y: "C:\Users\Groster\AppData\Local\GameMakerStudio2\GMS2TEMP" started at 06/07/2020 03:42:03
"cmd" /c subst X: "C:\ProgramData\GameMakerStudio2\Cache\runtimes\runtime-2.2.5.378"

elapsed time 00:00:00.0710041s for command "cmd" /c subst X: "C:\ProgramData\GameMakerStudio2\Cache\runtimes\runtime-2.2.5.378" started at 06/07/2020 03:42:03
"C:\ProgramData/GameMakerStudio2/Cache/runtimes\runtime-2.2.5.378/bin/Igor.exe" -j=8 -options="C:\Users\Groster\AppData\Local\GameMakerStudio2\GMS2TEMP\build.bff" -v -- Android Package

Loaded Macros from C:\Users\Groster\AppData\Roaming\GameMakerStudio2\Cache\GMS2CACHE\3333_2B21724B\macros.json
Options: X:/bin\platform_setting_defaults.json
Options: C:\Users\Groster\AppData\Roaming/GameMakerStudio2\yuriarmiuser_2000745\local_settings.json
Options: C:\Users\Groster\AppData\Roaming\GameMakerStudio2\Cache\GMS2CACHE\3333_2B21724B\targetoptions.json
X://bin/GMAssetCompiler.exe /c /zpex /iv=0 /rv=0 /bv=0 /j=8 /gn="3333" /td="Y:/" /cd="Z:/3333_2B21724B" /zpuf="C:\Users\Groster\AppData\Roaming/GameMakerStudio2\yuriarmiuser_2000745" /m=llvm-android /tgt=8 /llvmSource="X://yyc/" /nodnd /cfg="default" /fU="Z:/3333_2B21724B\functionsUsed.txt" /o="Y:/3333_2C015E11_YYC" /optionsini="Y:/3333_2C015E11_YYC\options.ini" /baseproject="X:/BaseProject\BaseProject.yyp" "C:\Users\Groster\Documents\GameMakerStudio2\3333\3333.yyp" /preprocess="Z:/3333_2B21724B"
Reading project file....C:\Users\Groster\Documents\GameMakerStudio2\3333
Reading project file....X:\BaseProject
Reading config delta 'C:\Users\Groster\Documents\GameMakerStudio2\3333\options\main\inherited\options_main.inherited.yy'
finished.


X://bin/GMAssetCompiler.exe DONE (0)
Release build
Options: Z:/3333_2B21724B\ExtensionOptions.json
PlatformOptions
Options: Z:/3333_2B21724B\PlatformOptions.json
Options: Z:/3333_2B21724B\MainOptions.json
runtime
OptionsIni
PlatformOptions
X://bin/GMAssetCompiler.exe /c /zpex /iv=0 /rv=0 /bv=0 /j=8 /gn="3333" /td="Y:/" /cd="Z:/3333_2B21724B" /zpuf="C:\Users\Groster\AppData\Roaming/GameMakerStudio2\yuriarmiuser_2000745" /m=llvm-android /tgt=8 /llvmSource="X://yyc/" /nodnd /cfg="default" /fU="Z:/3333_2B21724B\functionsUsed.txt" /o="Y:/3333_2C015E11_YYC" /optionsini="Y:/3333_2C015E11_YYC\options.ini" /baseproject="X:/BaseProject\BaseProject.yyp" "C:\Users\Groster\Documents\GameMakerStudio2\3333\3333.yyp" /arch=2 /bt=exe /rt=yyc
Reading project file....C:\Users\Groster\Documents\GameMakerStudio2\3333
Reading project file....X:\BaseProject
Reading config delta 'C:\Users\Groster\Documents\GameMakerStudio2\3333\options\main\inherited\options_main.inherited.yy'
finished.
Compile Constants...finished.
Remove DnD...finished.
Compile Scripts...finished.
Compile Objects...finished.
Compile Timelines...finished.
Compile Triggers...finished.
Compile Rooms...finished.
Compile Extensions...finished.
Global scripts...finished.
finished.
collapsing enums.
Final Compile...finished.
Writing Chunk... GEN8
option_game_speed=60
Writing Chunk... OPTN
Writing Chunk... LANG
Writing Chunk... EXTN
Writing Chunk... SOND
Writing Chunk... AGRP
Writing Chunk... SPRT
Writing Chunk... BGND
Writing Chunk... PATH
Writing Chunk... SCPT
Writing Chunk... GLOB
Writing Chunk... SHDR
Writing Chunk... FONT
Writing Chunk... TMLN
Writing Chunk... OBJT
Writing Chunk... ROOM
Writing Chunk... DAFL
Writing Chunk... EMBI
Writing Chunk... TPAGE
Writing Chunk... TGIN
Writing Chunk... STRG
Writing Chunk... TXTR
Writing Chunk... AUDO
ClangExeLocation=C:\SDK\ndk\21.0.6113669\toolchains\llvm\prebuilt\windows-x86_64\bin\clang++.exe
Using NDKDir = C:\SDK\ndk\21.0.6113669
Using PlatformDir = C:\SDK\ndk\21.0.6113669\platforms\android-29
Using ARMToolChain = C:\SDK\ndk\21.0.6113669\toolchains\arm-linux-androideabi-4.9\prebuilt\windows-x86_64
saving file Y:/3333_2C015E11_YYC\3333.droid
Z:\3333_2B21724B\3333\default\Scripts\llvm-android>start /w cmd.exe /v:on /c "call ndk.bat"
Z:\3333_2B21724B\3333\default\Scripts\llvm-android>type ndk.out
Android NDK: android-14 is unsupported. Using minimum supported version android-16.
Android NDK: WARNING: APP_PLATFORM android-16 is higher than android:minSdkVersion 14 in ./AndroidManifest.xml. NDK binaries will *not* be compatible with devices older than android-16. See https://android.googlesource.com/platform/ndk/+/master/docs/user/common_problems.md for more information.
[armeabi-v7a] Prebuilt : libc++_shared.so <= <NDK>/sources/cxx-stl/llvm-libc++/libs/armeabi-v7a/
[armeabi-v7a] Install : libc++_shared.so => Y:/3333_2C015E11_YYC/lib/armeabi-v7a/libc++_shared.so
[armeabi-v7a] Compile++ arm : yoyo <= _3333.vars.cpp
[armeabi-v7a] SharedLibrary : libyoyo.so
[armeabi-v7a] Install : libyoyo.so => Y:/3333_2C015E11_YYC/lib/armeabi-v7a/libyoyo.so
Z:\3333_2B21724B\3333\default\Scripts\llvm-android>set /p exitcode= 0<exitcode.txt
Z:\3333_2B21724B\3333\default\Scripts\llvm-android>exit /b %exitcode%
Z:\3333_2B21724B\3333\default\Scripts\llvm-android>exit /b 0
Z:\3333_2B21724B\3333\default\Scripts\llvm-android>
Stats : GMA : Elapsed=2130,1218
Stats : GMA : sp=0,au=0,bk=0,pt=0,sc=0,sh=0,fo=0,tl=0,ob=0,ro=1,da=0,ex=0,ma=2,fm=0x0


X://bin/GMAssetCompiler.exe DONE (0)
AndroidEnvironment
Manifest Permissions
Manifest Metadata
Check GML functions
Licensing
3
Copying X:/Android\runner\RootFiles\build.gradle to Z:/3333_2B21724B\Android\default\build.gradle...
Copying X:/Android\runner\RootFiles\gradle.properties to Z:/3333_2B21724B\Android\default\gradle.properties...
Copying X:/Android\runner\RootFiles\settings.gradle to Z:/3333_2B21724B\Android\default\settings.gradle...
59
Copying X:/Android\runner\ProjectFiles\build.gradle to Z:/3333_2B21724B\Android\default\com.company.game\build.gradle...
Copying X:/Android\runner\ProjectFiles\lint.xml to Z:/3333_2B21724B\Android\default\com.company.game\lint.xml...
Copying X:/Android\runner\ProjectFiles\libs\ini4j-0.5.2.jar to Z:/3333_2B21724B\Android\default\com.company.game\libs\ini4j-0.5.2.jar...
Copying X:/Android\runner\ProjectFiles\libs\org.apache.http.legacy.jar to Z:/3333_2B21724B\Android\default\com.company.game\libs\org.apache.http.legacy.jar...
Copying X:/Android\runner\ProjectFiles\src\main\AndroidManifest.xml to Z:/3333_2B21724B\Android\default\com.company.game\src\main\AndroidManifest.xml...
Copying X:/Android\runner\ProjectFiles\src\main\assets\splash.png to Z:/3333_2B21724B\Android\default\com.company.game\src\main\assets\splash.png...
Copying X:/Android\runner\ProjectFiles\src\main\java\com\yoyogames\runner\RunnerJNILib.java to Z:/3333_2B21724B\Android\default\com.company.game\src\main\java\com\yoyogames\runner\RunnerJNILib.java...
Copying X:/Android\runner\ProjectFiles\src\main\java\YYAndroidPackageDomain\YYAndroidPackageCompany\YYAndroidPackageProduct\AdvertisingBase.java to Z:/3333_2B21724B\Android\default\com.company.game\src\main\java\com\company\game\AdvertisingBase.java...
Copying X:/Android\runner\ProjectFiles\src\main\java\YYAndroidPackageDomain\YYAndroidPackageCompany\YYAndroidPackageProduct\DemoGLSurfaceView.java to Z:/3333_2B21724B\Android\default\com.company.game\src\main\java\com\company\game\DemoGLSurfaceView.java...
Copying X:/Android\runner\ProjectFiles\src\main\java\YYAndroidPackageDomain\YYAndroidPackageCompany\YYAndroidPackageProduct\DemoRenderer.java to Z:/3333_2B21724B\Android\default\com.company.game\src\main\java\com\company\game\DemoRenderer.java...
Copying X:/Android\runner\ProjectFiles\src\main\java\YYAndroidPackageDomain\YYAndroidPackageCompany\YYAndroidPackageProduct\DemoRendererGL2.java to Z:/3333_2B21724B\Android\default\com.company.game\src\main\java\com\company\game\DemoRendererGL2.java...
Copying X:/Android\runner\ProjectFiles\src\main\java\YYAndroidPackageDomain\YYAndroidPackageCompany\YYAndroidPackageProduct\ExtensionBase.java to Z:/3333_2B21724B\Android\default\com.company.game\src\main\java\com\company\game\ExtensionBase.java...
Copying X:/Android\runner\ProjectFiles\src\main\java\YYAndroidPackageDomain\YYAndroidPackageCompany\YYAndroidPackageProduct\IAdExt.java to Z:/3333_2B21724B\Android\default\com.company.game\src\main\java\com\company\game\IAdExt.java...
Copying X:/Android\runner\ProjectFiles\src\main\java\YYAndroidPackageDomain\YYAndroidPackageCompany\YYAndroidPackageProduct\IAdvertising.java to Z:/3333_2B21724B\Android\default\com.company.game\src\main\java\com\company\game\IAdvertising.java...
Copying X:/Android\runner\ProjectFiles\src\main\java\YYAndroidPackageDomain\YYAndroidPackageCompany\YYAndroidPackageProduct\IExtensionBase.java to Z:/3333_2B21724B\Android\default\com.company.game\src\main\java\com\company\game\IExtensionBase.java...
Copying X:/Android\runner\ProjectFiles\src\main\java\YYAndroidPackageDomain\YYAndroidPackageCompany\YYAndroidPackageProduct\IniBundle.java to Z:/3333_2B21724B\Android\default\com.company.game\src\main\java\com\company\game\IniBundle.java...
Copying X:/Android\runner\ProjectFiles\src\main\java\YYAndroidPackageDomain\YYAndroidPackageCompany\YYAndroidPackageProduct\ISocial.java to Z:/3333_2B21724B\Android\default\com.company.game\src\main\java\com\company\game\ISocial.java...
Copying X:/Android\runner\ProjectFiles\src\main\java\YYAndroidPackageDomain\YYAndroidPackageCompany\YYAndroidPackageProduct\RunnerActivity.java to Z:/3333_2B21724B\Android\default\com.company.game\src\main\java\com\company\game\RunnerActivity.java...
Copying X:/Android\runner\ProjectFiles\src\main\java\YYAndroidPackageDomain\YYAndroidPackageCompany\YYAndroidPackageProduct\RunnerAdExt.java to Z:/3333_2B21724B\Android\default\com.company.game\src\main\java\com\company\game\RunnerAdExt.java...
Copying X:/Android\runner\ProjectFiles\src\main\java\YYAndroidPackageDomain\YYAndroidPackageCompany\YYAndroidPackageProduct\RunnerApplication.java to Z:/3333_2B21724B\Android\default\com.company.game\src\main\java\com\company\game\RunnerApplication.java...
Copying X:/Android\runner\ProjectFiles\src\main\java\YYAndroidPackageDomain\YYAndroidPackageCompany\YYAndroidPackageProduct\RunnerKeyboardController.java to Z:/3333_2B21724B\Android\default\com.company.game\src\main\java\com\company\game\RunnerKeyboardController.java...
Copying X:/Android\runner\ProjectFiles\src\main\java\YYAndroidPackageDomain\YYAndroidPackageCompany\YYAndroidPackageProduct\RunnerSocial.java to Z:/3333_2B21724B\Android\default\com.company.game\src\main\java\com\company\game\RunnerSocial.java...
Copying X:/Android\runner\ProjectFiles\src\main\java\YYAndroidPackageDomain\YYAndroidPackageCompany\YYAndroidPackageProduct\RunnerVsyncHandler.java to Z:/3333_2B21724B\Android\default\com.company.game\src\main\java\com\company\game\RunnerVsyncHandler.java...
Copying X:/Android\runner\ProjectFiles\src\main\java\YYAndroidPackageDomain\YYAndroidPackageCompany\YYAndroidPackageProduct\Gamepad\Gamepad.java to Z:/3333_2B21724B\Android\default\com.company.game\src\main\java\com\company\game\Gamepad\Gamepad.java...
Copying X:/Android\runner\ProjectFiles\src\main\java\YYAndroidPackageDomain\YYAndroidPackageCompany\YYAndroidPackageProduct\Purchases\IRunnerBilling.java to Z:/3333_2B21724B\Android\default\com.company.game\src\main\java\com\company\game\Purchases\IRunnerBilling.java...
Copying X:/Android\runner\ProjectFiles\src\main\java\YYAndroidPackageDomain\YYAndroidPackageCompany\YYAndroidPackageProduct\Purchases\Null\NullBilling.java to Z:/3333_2B21724B\Android\default\com.company.game\src\main\java\com\company\game\Purchases\Null\NullBilling.java...
Copying X:/Android\runner\ProjectFiles\src\main\jniLibs\arm64-v8a\libc++_shared.so to Z:/3333_2B21724B\Android\default\com.company.game\src\main\jniLibs\arm64-v8a\libc++_shared.so...
Copying X:/Android\runner\ProjectFiles\src\main\jniLibs\arm64-v8a\libyoyo.so to Z:/3333_2B21724B\Android\default\com.company.game\src\main\jniLibs\arm64-v8a\libyoyo.so...
Copying X:/Android\runner\ProjectFiles\src\main\jniLibs\armeabi\libyoyo.so to Z:/3333_2B21724B\Android\default\com.company.game\src\main\jniLibs\armeabi\libyoyo.so...
Copying X:/Android\runner\ProjectFiles\src\main\jniLibs\armeabi-v7a\libc++_shared.so to Z:/3333_2B21724B\Android\default\com.company.game\src\main\jniLibs\armeabi-v7a\libc++_shared.so...
Copying X:/Android\runner\ProjectFiles\src\main\jniLibs\armeabi-v7a\libyoyo.so to Z:/3333_2B21724B\Android\default\com.company.game\src\main\jniLibs\armeabi-v7a\libyoyo.so...
Copying X:/Android\runner\ProjectFiles\src\main\jniLibs\mips\libyoyo.so to Z:/3333_2B21724B\Android\default\com.company.game\src\main\jniLibs\mips\libyoyo.so...
Copying X:/Android\runner\ProjectFiles\src\main\jniLibs\mips64\libyoyo.so to Z:/3333_2B21724B\Android\default\com.company.game\src\main\jniLibs\mips64\libyoyo.so...
Copying X:/Android\runner\ProjectFiles\src\main\jniLibs\x86\libc++_shared.so to Z:/3333_2B21724B\Android\default\com.company.game\src\main\jniLibs\x86\libc++_shared.so...
Copying X:/Android\runner\ProjectFiles\src\main\jniLibs\x86\libyoyo.so to Z:/3333_2B21724B\Android\default\com.company.game\src\main\jniLibs\x86\libyoyo.so...
Copying X:/Android\runner\ProjectFiles\src\main\jniLibs\x86_64\libc++_shared.so to Z:/3333_2B21724B\Android\default\com.company.game\src\main\jniLibs\x86_64\libc++_shared.so...
Copying X:/Android\runner\ProjectFiles\src\main\jniLibs\x86_64\libyoyo.so to Z:/3333_2B21724B\Android\default\com.company.game\src\main\jniLibs\x86_64\libyoyo.so...
Copying X:/Android\runner\ProjectFiles\src\main\res\drawable-hdpi\icon.png to Z:/3333_2B21724B\Android\default\com.company.game\src\main\res\drawable-hdpi\icon.png...
Copying X:/Android\runner\ProjectFiles\src\main\res\drawable-hdpi-v26\adaptive_bg.png to Z:/3333_2B21724B\Android\default\com.company.game\src\main\res\drawable-hdpi-v26\adaptive_bg.png...
Copying X:/Android\runner\ProjectFiles\src\main\res\drawable-hdpi-v26\adaptive_icon.png to Z:/3333_2B21724B\Android\default\com.company.game\src\main\res\drawable-hdpi-v26\adaptive_icon.png...
Copying X:/Android\runner\ProjectFiles\src\main\res\drawable-hdpi-v26\icon.xml to Z:/3333_2B21724B\Android\default\com.company.game\src\main\res\drawable-hdpi-v26\icon.xml...
Copying X:/Android\runner\ProjectFiles\src\main\res\drawable-ldpi-v26\adaptive_bg.png to Z:/3333_2B21724B\Android\default\com.company.game\src\main\res\drawable-ldpi-v26\adaptive_bg.png...
Copying X:/Android\runner\ProjectFiles\src\main\res\drawable-ldpi-v26\adaptive_icon.png to Z:/3333_2B21724B\Android\default\com.company.game\src\main\res\drawable-ldpi-v26\adaptive_icon.png...
Copying X:/Android\runner\ProjectFiles\src\main\res\drawable-ldpi-v26\icon.xml to Z:/3333_2B21724B\Android\default\com.company.game\src\main\res\drawable-ldpi-v26\icon.xml...
Copying X:/Android\runner\ProjectFiles\src\main\res\drawable-mdpi-v26\adaptive_bg.png to Z:/3333_2B21724B\Android\default\com.company.game\src\main\res\drawable-mdpi-v26\adaptive_bg.png...
Copying X:/Android\runner\ProjectFiles\src\main\res\drawable-mdpi-v26\adaptive_icon.png to Z:/3333_2B21724B\Android\default\com.company.game\src\main\res\drawable-mdpi-v26\adaptive_icon.png...
Copying X:/Android\runner\ProjectFiles\src\main\res\drawable-mdpi-v26\icon.xml to Z:/3333_2B21724B\Android\default\com.company.game\src\main\res\drawable-mdpi-v26\icon.xml...
Copying X:/Android\runner\ProjectFiles\src\main\res\drawable-xhdpi-v26\adaptive_bg.png to Z:/3333_2B21724B\Android\default\com.company.game\src\main\res\drawable-xhdpi-v26\adaptive_bg.png...
Copying X:/Android\runner\ProjectFiles\src\main\res\drawable-xhdpi-v26\adaptive_icon.png to Z:/3333_2B21724B\Android\default\com.company.game\src\main\res\drawable-xhdpi-v26\adaptive_icon.png...
Copying X:/Android\runner\ProjectFiles\src\main\res\drawable-xhdpi-v26\icon.xml to Z:/3333_2B21724B\Android\default\com.company.game\src\main\res\drawable-xhdpi-v26\icon.xml...
Copying X:/Android\runner\ProjectFiles\src\main\res\drawable-xxhdpi-v26\adaptive_bg.png to Z:/3333_2B21724B\Android\default\com.company.game\src\main\res\drawable-xxhdpi-v26\adaptive_bg.png...
Copying X:/Android\runner\ProjectFiles\src\main\res\drawable-xxhdpi-v26\adaptive_icon.png to Z:/3333_2B21724B\Android\default\com.company.game\src\main\res\drawable-xxhdpi-v26\adaptive_icon.png...
Copying X:/Android\runner\ProjectFiles\src\main\res\drawable-xxhdpi-v26\icon.xml to Z:/3333_2B21724B\Android\default\com.company.game\src\main\res\drawable-xxhdpi-v26\icon.xml...
Copying X:/Android\runner\ProjectFiles\src\main\res\drawable-xxxhdpi-v26\adaptive_bg.png to Z:/3333_2B21724B\Android\default\com.company.game\src\main\res\drawable-xxxhdpi-v26\adaptive_bg.png...
Copying X:/Android\runner\ProjectFiles\src\main\res\drawable-xxxhdpi-v26\adaptive_icon.png to Z:/3333_2B21724B\Android\default\com.company.game\src\main\res\drawable-xxxhdpi-v26\adaptive_icon.png...
Copying X:/Android\runner\ProjectFiles\src\main\res\drawable-xxxhdpi-v26\icon.xml to Z:/3333_2B21724B\Android\default\com.company.game\src\main\res\drawable-xxxhdpi-v26\icon.xml...
Copying X:/Android\runner\ProjectFiles\src\main\res\layout\main.xml to Z:/3333_2B21724B\Android\default\com.company.game\src\main\res\layout\main.xml...
Copying X:/Android\runner\ProjectFiles\src\main\res\layout\userpasslayout.xml to Z:/3333_2B21724B\Android\default\com.company.game\src\main\res\layout\userpasslayout.xml...
Copying X:/Android\runner\ProjectFiles\src\main\res\values\strings.xml to Z:/3333_2B21724B\Android\default\com.company.game\src\main\res\values\strings.xml...
DoSplash
DoIcon
C:\Windows\system32\cmd.exe /c "subst W: "Z:/3333_2B21724B\Android\default" && W: && cd "com.company.game" && "X:/Android\runner\gradle\gradlew" build assembleRelease -x lint "
Starting a Gradle Daemon (subsequent builds will be faster)
Exception in thread "DisconnectableInputStream source reader" org.gradle.api.UncheckedIOException: java.io.IOException: �������� ����������
at org.gradle.internal.UncheckedException.throwAsUncheckedException(UncheckedException.java:61)
at org.gradle.internal.UncheckedException.throwAsUncheckedException(UncheckedException.java:41)
at org.gradle.util.DisconnectableInputStream$1.run(DisconnectableInputStream.java:125)
at java.lang.Thread.run(Thread.java:748)
Caused by: java.io.IOException: �������� ����������
at java.io.FileInputStream.readBytes(Native Method)
at java.io.FileInputStream.read(FileInputStream.java:255)
at java.io.BufferedInputStream.fill(BufferedInputStream.java:246)
at java.io.BufferedInputStream.read1(BufferedInputStream.java:286)
at java.io.BufferedInputStream.read(BufferedInputStream.java:345)
at org.gradle.util.DisconnectableInputStream$1.run(DisconnectableInputStream.java:96)
... 1 more
> Task :com.company.game:preBuild UP-TO-DATE
> Task :com.company.game:prepareLintJar
> Task :com.company.game:preDebugBuild
> Task :com.company.game:compileDebugAidl NO-SOURCE
> Task :com.company.game:compileDebugRenderscript NO-SOURCE
> Task :com.company.game:checkDebugManifest
> Task :com.company.game:generateDebugBuildConfig
> Task :com.company.game:generateDebugSources
> Task :com.company.game:javaPreCompileDebug
> Task :com.company.game:mainApkListPersistenceDebug
> Task :com.company.game:generateDebugResValues
> Task :com.company.game:generateDebugResources
> Task :com.company.game:mergeDebugResources
> Task :com.company.game:createDebugCompatibleScreenManifests

> Task :com.company.game:processDebugManifest
W:\com.company.game\src\main\AndroidManifest.xml:27:3-75:17 Warning:
application@android:label was tagged at AndroidManifest.xml:27 to replace other declarations but no other declaration present
W:\com.company.game\src\main\AndroidManifest.xml:28:5-37:16 Warning:
activity#com.company.game.RunnerActivity@android:label was tagged at AndroidManifest.xml:28 to replace other declarations but no other declaration present
W:\com.company.game\src\main\AndroidManifest.xml:27:3-75:17 Warning:
application@android:label was tagged at AndroidManifest.xml:27 to replace other declarations but no other declaration present
W:\com.company.game\src\main\AndroidManifest.xml:28:5-37:16 Warning:
activity#com.company.game.RunnerActivity@android:label was tagged at AndroidManifest.xml:28 to replace other declarations but no other declaration present

> Task :com.company.game:processDebugResources

> Task :com.company.game:compileDebugJavaWithJavac
Note: Some input files use or override a deprecated API.
Note: Recompile with -Xlint:deprecation for details.

> Task :com.company.game:compileDebugSources
> Task :com.company.game:mergeDebugShaders
> Task :com.company.game:compileDebugShaders
> Task :com.company.game:generateDebugAssets
> Task :com.company.game:mergeDebugAssets
> Task :com.company.game:validateSigningDebug
> Task :com.company.game:checkDebugDuplicateClasses
> Task :com.company.game:transformClassesWithDexBuilderForDebug
> Task :com.company.game:transformClassesWithMultidexlistForDebug
> Task :com.company.game:mergeDexDebug
> Task :com.company.game:signingConfigWriterDebug
> Task :com.company.game:mergeDebugJniLibFolders
> Task :com.company.game:transformNativeLibsWithMergeJniLibsForDebug
> Task :com.company.game:processDebugJavaRes NO-SOURCE
> Task :com.company.game:transformResourcesWithMergeJavaResForDebug
> Task :com.company.game:packageDebug
> Task :com.company.game:assembleDebug
> Task :com.company.game:preReleaseBuild
> Task :com.company.game:compileReleaseAidl NO-SOURCE
> Task :com.company.game:compileReleaseRenderscript NO-SOURCE
> Task :com.company.game:checkReleaseManifest
> Task :com.company.game:generateReleaseBuildConfig
> Task :com.company.game:generateReleaseSources
> Task :com.company.game:javaPreCompileRelease
> Task :com.company.game:mainApkListPersistenceRelease
> Task :com.company.game:generateReleaseResValues
> Task :com.company.game:generateReleaseResources
> Task :com.company.game:mergeReleaseResources
> Task :com.company.game:createReleaseCompatibleScreenManifests

> Task :com.company.game:processReleaseManifest
W:\com.company.game\src\main\AndroidManifest.xml:27:3-75:17 Warning:
application@android:label was tagged at AndroidManifest.xml:27 to replace other declarations but no other declaration present
W:\com.company.game\src\main\AndroidManifest.xml:28:5-37:16 Warning:
activity#com.company.game.RunnerActivity@android:label was tagged at AndroidManifest.xml:28 to replace other declarations but no other declaration present
W:\com.company.game\src\main\AndroidManifest.xml:27:3-75:17 Warning:
application@android:label was tagged at AndroidManifest.xml:27 to replace other declarations but no other declaration present
W:\com.company.game\src\main\AndroidManifest.xml:28:5-37:16 Warning:
activity#com.company.game.RunnerActivity@android:label was tagged at AndroidManifest.xml:28 to replace other declarations but no other declaration present

> Task :com.company.game:processReleaseResources

> Task :com.company.game:compileReleaseJavaWithJavac
Note: Some input files use or override a deprecated API.

Note: Recompile with -Xlint:deprecation for details.
> Task :com.company.game:compileReleaseSources
> Task :com.company.game:lintVitalRelease
> Task :com.company.game:checkReleaseDuplicateClasses
> Task :com.company.game:transformClassesWithDexBuilderForRelease
> Task :com.company.game:transformClassesWithMultidexlistForRelease
> Task :com.company.game:mergeDexRelease
> Task :com.company.game:mergeReleaseShaders
> Task :com.company.game:compileReleaseShaders
> Task :com.company.game:generateReleaseAssets
> Task :com.company.game:mergeReleaseAssets
> Task :com.company.game:validateSigningRelease
> Task :com.company.game:signingConfigWriterRelease
> Task :com.company.game:mergeReleaseJniLibFolders
> Task :com.company.game:transformNativeLibsWithMergeJniLibsForRelease
> Task :com.company.game:processReleaseJavaRes NO-SOURCE
> Task :com.company.game:transformResourcesWithMergeJavaResForRelease
> Task :com.company.game:packageRelease
> Task :com.company.game:assembleRelease
> Task :com.company.game:assemble
> Task :com.company.game:generateDebugUnitTestSources
> Task :com.company.game:preDebugUnitTestBuild UP-TO-DATE
> Task :com.company.game:javaPreCompileDebugUnitTest
> Task :com.company.game:compileDebugUnitTestJavaWithJavac NO-SOURCE
> Task :com.company.game:processDebugUnitTestJavaRes NO-SOURCE
> Task :com.company.game:testDebugUnitTest NO-SOURCE
> Task :com.company.game:generateReleaseUnitTestSources
> Task :com.company.game:preReleaseUnitTestBuild UP-TO-DATE
> Task :com.company.game:javaPreCompileReleaseUnitTest
> Task :com.company.game:compileReleaseUnitTestJavaWithJavac NO-SOURCE
> Task :com.company.game:processReleaseUnitTestJavaRes NO-SOURCE
> Task :com.company.game:testReleaseUnitTest NO-SOURCE
> Task :com.company.game:test UP-TO-DATE
> Task :com.company.game:check
> Task :com.company.game:build

Deprecated Gradle features were used in this build, making it incompatible with Gradle 6.0.
Use '--warning-mode all' to show the individual deprecation warnings.
See https://docs.gradle.org/5.1.1/userguide/command_line_interface.html#sec:command_line_warnings

BUILD SUCCESSFUL in 34s
52 actionable tasks: 52 executed


C:\Windows\system32\cmd.exe DONE (0)
C:\Windows\system32\subst.exe /d W:


C:\Windows\system32\subst.exe DONE (0)
Igor complete.
C:\SDK\platform-tools\adb kill-server


C:\SDK\platform-tools\adb DONE (0)
Igor complete.

 

KatDav

Member
I was gonna ask, I try to run mine in an AVD (android virtual device) and it still wont work right, gives me file port fails, so im trying to figure that out, how did you get a successful build , i have a failed build? i too am trying to learn this and trying to take notes and ask stuff as I go?
 

Groster

Member
Yes, I was able to compile a smaller project on the phone.
Moreover, I was even able to make the installation file that the phone received.
But the flagship project is still not amenable.
Could there be a problem in that it was started at the first studio, and the second adopted its compilation version as the main one?

I think so because of this moment.


Android NDK: android-14 is unsupported. Using minimum supported version android-16.
Android NDK: WARNING: APP_PLATFORM android-16 is higher than android:minSdkVersion 14 in ./AndroidManifest.xml. NDK binaries will *not* be compatible with devices older than android-16. See https://android.googlesource.com/platform/ndk/+/master/docs/user/common_problems.md for more information.
 

Groster

Member
I was gonna ask, I try to run mine in an AVD (android virtual device) and it still wont work right, gives me file port fails, so im trying to figure that out, how did you get a successful build , i have a failed build? i too am trying to learn this and trying to take notes and ask stuff as I go?

The assembly turned out by selecting the right development kit in the manager.
You should use SDK 29 (android project settings).
Android device required.
The drivers of your android device must be installed.
Emulation works very poorly, it is better to use a real device.
On the device, the developer settings and debugging by USB should be unlocked.
It is advisable to immediately test on the device, as some textures may disappear.
If the textures are gone, then you should play with the texture resolution in the project settings.
If your assembly does not compile after these manipulations, then you should try another NDK version.

I tried to describe as clearly as possible.
If I find out something in detail about this, I will write here)
 

KatDav

Member
ive tried everything when it comes to actually using an actual android device as it doesnt work for some reason even when updating my android drivers, unless there is specific drivers that i need for it, but i found the drivers my phone seeks when connecting it to the pc. Ive even done the same to my tablet which i thought would work better more so than my actual phone. hrrmm im just lost on this though sadly. Im close to figuring out how to connect it with AVD more so which i thought would be the better bet, but i dont know?
here is part of the error in my output ?

GML:
> Configure project :dllib
WARNING: Configuration 'compile' is obsolete and has been replaced with 'implementation' and 'api'.
It will be removed at the end of 2018. For more information see: http://d.android.com/r/tools/update-dependency-configurations.html

FAILURE: Build failed with an exception.

* Where:
Build file 'Y:\dllib\build.gradle' line: 40

* What went wrong:
A problem occurred evaluating project ':dllib'.
> Project with path ':allib' could not be found in project ':dllib'.

* Try:
Run with --stacktrace option to get the stack trace. Run with --info or --debug option to get more log output. Run with --scan to get full insights.

* Get more help at https://help.gradle.org

BUILD FAILED in 0s


C:\WINDOWS\system32\cmd.exe DONE (1)
C:\WINDOWS\system32\subst.exe /d Y:
 

Groster

Member
ive tried everything when it comes to actually using an actual android device as it doesnt work for some reason even when updating my android drivers, unless there is specific drivers that i need for it, but i found the drivers my phone seeks when connecting it to the pc. Ive even done the same to my tablet which i thought would work better more so than my actual phone. hrrmm im just lost on this though sadly. Im close to figuring out how to connect it with AVD more so which i thought would be the better bet, but i dont know?
here is part of the error in my output ?
Developer mode unlocked?
Do game maker studios 2 have administrator rights?
This is all very important ...
If at least one point is not observed, then departures are possible.

Also go to the manager in android studios.
Further in SDK tools.
Next, check the box next to Show package Details.
Check if all the necessary builders have been downloaded.
At first, I got errors due to the lack of some.
Everything is fine with 28.0.3+ installed.
Up to 29.0.3 (this is also necessary).
43533.png
 

Groster

Member
Learned one more thing.
Do not use google play services until they are updated.
I don’t know why, but compiling with any of them is an error.
I tried with everyone.

UPD:If someone knows how to solve this problem, please report here.
 
Last edited:

Groster

Member
So, I tried to roll back the environment to 2.2.4.
There is still a compilation error with Google services.
Who knows what to do with this?




Code:
Saving project to: C:\Users\Groster\Documents\GameMakerStudio2\wild clumsy squeak\wild clumsy squeak.yyp
Saving 3 resources
"cmd"  /c subst Z: "C:\Users\Groster\AppData\Roaming\GameMakerStudio2\Cache\GMS2CACHE"

elapsed time 00:00:00.0150008s for command "cmd" /c subst Z: "C:\Users\Groster\AppData\Roaming\GameMakerStudio2\Cache\GMS2CACHE" started at 06/11/2020 00:09:44
"cmd"  /c subst Y: "C:\Users\Groster\AppData\Local\GameMakerStudio2\GMS2TEMP"

elapsed time 00:00:00.0130007s for command "cmd" /c subst Y: "C:\Users\Groster\AppData\Local\GameMakerStudio2\GMS2TEMP" started at 06/11/2020 00:09:44
"cmd"  /c subst X: "C:\ProgramData\GameMakerStudio2\Cache\runtimes\runtime-2.2.4.374"

elapsed time 00:00:00.0130007s for command "cmd" /c subst X: "C:\ProgramData\GameMakerStudio2\Cache\runtimes\runtime-2.2.4.374" started at 06/11/2020 00:09:44
"C:\ProgramData/GameMakerStudio2/Cache/runtimes\runtime-2.2.4.374/bin/Igor.exe"  -j=8 -options="C:\Users\Groster\AppData\Local\GameMakerStudio2\GMS2TEMP\build.bff" -v -- Android Package

Loaded Macros from C:\Users\Groster\AppData\Roaming\GameMakerStudio2\Cache\GMS2CACHE\wild_clums_E71572DB_80BECD1F\macros.json
Options: X:/bin\platform_setting_defaults.json
Options: C:\Users\Groster\AppData\Roaming/GameMakerStudio2\yuriarmiuser_2000745\local_settings.json
Options: C:\Users\Groster\AppData\Roaming\GameMakerStudio2\Cache\GMS2CACHE\wild_clums_E71572DB_80BECD1F\targetoptions.json
X://bin/GMAssetCompiler.exe  /c /zpex /iv=0 /rv=0 /bv=0 /j=8  /gn="wild clumsy squeak" /td="Y:/" /cd="Z:/wild_clums_E71572DB_80BECD1F" /zpuf="C:\Users\Groster\AppData\Roaming/GameMakerStudio2\yuriarmiuser_2000745" /m=llvm-android /tgt=8 /llvmSource="X://yyc/"  /nodnd /cfg="default" /fU="Z:/wild_clums_E71572DB_80BECD1F\functionsUsed.txt" /o="Y:/wild_clumsy_squeak_688CBCBC_YYC" /optionsini="Y:/wild_clumsy_squeak_688CBCBC_YYC\options.ini" /baseproject="X:/BaseProject\BaseProject.yyp" "C:\Users\Groster\Documents\GameMakerStudio2\wild clumsy squeak\wild clumsy squeak.yyp" /preprocess="Z:/wild_clums_E71572DB_80BECD1F"
Reading project file....C:\Users\Groster\Documents\GameMakerStudio2\wild clumsy squeak
Reading project file....X:\BaseProject
Reading config delta 'C:\Users\Groster\Documents\GameMakerStudio2\wild clumsy squeak\options\main\inherited\options_main.inherited.yy'
finished.


X://bin/GMAssetCompiler.exe DONE (0)
Release build
Options: Z:/wild_clums_E71572DB_80BECD1F\ExtensionOptions.json
PlatformOptions
Options: Z:/wild_clums_E71572DB_80BECD1F\PlatformOptions.json
Options: Z:/wild_clums_E71572DB_80BECD1F\MainOptions.json
displayname
hostname
runtime
OptionsIni
PlatformOptions
X://bin/GMAssetCompiler.exe  /c /zpex /iv=0 /rv=0 /bv=0 /j=8  /gn="wild clumsy squeak" /td="Y:/" /cd="Z:/wild_clums_E71572DB_80BECD1F" /zpuf="C:\Users\Groster\AppData\Roaming/GameMakerStudio2\yuriarmiuser_2000745" /m=llvm-android /tgt=8 /llvmSource="X://yyc/"  /nodnd /cfg="default" /fU="Z:/wild_clums_E71572DB_80BECD1F\functionsUsed.txt" /o="Y:/wild_clumsy_squeak_688CBCBC_YYC" /optionsini="Y:/wild_clumsy_squeak_688CBCBC_YYC\options.ini" /baseproject="X:/BaseProject\BaseProject.yyp" "C:\Users\Groster\Documents\GameMakerStudio2\wild clumsy squeak\wild clumsy squeak.yyp" /arch=18 /bt=exe /rt=yyc
Reading project file....C:\Users\Groster\Documents\GameMakerStudio2\wild clumsy squeak
Reading project file....X:\BaseProject
Reading config delta 'C:\Users\Groster\Documents\GameMakerStudio2\wild clumsy squeak\options\main\inherited\options_main.inherited.yy'
finished.
Compile Constants...finished.
Remove DnD...finished.
Compile Scripts...finished.
Compile Objects...finished.
Compile Timelines...finished.
Compile Triggers...finished.
Compile Rooms...finished.
Compile Extensions...finished.
Global scripts...finished.
finished.
collapsing enums.
Final Compile...finished.
Writing Chunk... GEN8
option_game_speed=60
Writing Chunk... OPTN
Writing Chunk... LANG
Writing Chunk... EXTN
Writing Chunk... SOND
Writing Chunk... AGRP
Writing Chunk... SPRT
Writing Chunk... BGND
Writing Chunk... PATH
Writing Chunk... SCPT
Writing Chunk... GLOB
Writing Chunk... SHDR
Writing Chunk... FONT
Writing Chunk... TMLN
Writing Chunk... OBJT
Writing Chunk... ROOM
Writing Chunk... DAFL
Writing Chunk... EMBI
Writing Chunk... TPAGE
Texture Group - Default
Writing Chunk... TGIN
Writing Chunk... STRG
Writing Chunk... TXTR
0 Compressing texture... writing texture texture_0.png...
Writing Chunk... AUDO
ClangExeLocation=C:\SDK\ndk\21.0.6113669\toolchains\llvm\prebuilt\windows-x86_64\bin\clang++.exe
Using NDKDir = C:\SDK\ndk\21.0.6113669
Using PlatformDir = C:\SDK\ndk\21.0.6113669\platforms\android-29
Using ARMToolChain = C:\SDK\ndk\21.0.6113669\toolchains\arm-linux-androideabi-4.9\prebuilt\windows-x86_64
Using ARM64ToolChain = C:\SDK\ndk\21.0.6113669\toolchains\aarch64-linux-android-4.9\prebuilt\windows-x86_64
saving file Y:/wild_clumsy_squeak_688CBCBC_YYC\wild clumsy squeak.droid
Z:\wild_clums_E71572DB_80BECD1F\wild clumsy squeak\default\Scripts\llvm-android>start /w cmd.exe /v:on /c "call ndk.bat"
Z:\wild_clums_E71572DB_80BECD1F\wild clumsy squeak\default\Scripts\llvm-android>type ndk.out
Android NDK: android-14 is unsupported. Using minimum supported version android-16.   
Android NDK: WARNING: APP_PLATFORM android-16 is higher than android:minSdkVersion 14 in ./AndroidManifest.xml. NDK binaries will *not* be compatible with devices older than android-16. See https://android.googlesource.com/platform/ndk/+/master/docs/user/common_problems.md for more information.   
[armeabi-v7a] Compile++ arm  : yoyo <= gml_Object_Next_room_obj_PreCreate_0.gml.cpp
[armeabi-v7a] Compile++ arm  : yoyo <= gml_Object_object0_Create_0.gml.cpp
[armeabi-v7a] Compile++ arm  : yoyo <= gml_Object_object0_Other_40.gml.cpp
[armeabi-v7a] Compile++ arm  : yoyo <= gml_Object_object0_PreCreate_0.gml.cpp
[armeabi-v7a] Compile++ arm  : yoyo <= gml_Object_Next_room_obj_Create_0.gml.cpp
[armeabi-v7a] Compile++ arm  : yoyo <= gml_Object_object2_Create_0.gml.cpp
[armeabi-v7a] Compile++ arm  : yoyo <= gml_Object_object0_Mouse_53.gml.cpp
[armeabi-v7a] Compile++ arm  : yoyo <= gml_Object_object0_Step_0.gml.cpp
[armeabi-v7a] Compile++ arm  : yoyo <= gml_Object_object2_PreCreate_0.gml.cpp
[armeabi-v7a] Compile++ arm  : yoyo <= gml_Object_Control_room_ob_Alarm_0.gml.cpp
[armeabi-v7a] Compile++ arm  : yoyo <= gml_Object_Control_room_ob_PreCreate_0.gml.cpp
[armeabi-v7a] Compile++ arm  : yoyo <= gml_Object_Control_room_ob_Create_0.gml.cpp
[armeabi-v7a] Compile++ arm  : yoyo <= gml_Object_Control_room_ob_Step_0.gml.cpp
[armeabi-v7a] Compile++ arm  : yoyo <= gml_Object_object4_Create_0.gml.cpp
[armeabi-v7a] Compile++ arm  : yoyo <= gml_Object_object4_PreCreate_0.gml.cpp
[armeabi-v7a] Compile++ arm  : yoyo <= gml_Object_object4_Collision_2a4cd23a_86b5_482a_8363_ac32e113379f.gml.cpp
[armeabi-v7a] Compile++ arm  : yoyo <= gml_Object_object5_Create_0.gml.cpp
[armeabi-v7a] Compile++ arm  : yoyo <= gml_Object_object5_PreCreate_0.gml.cpp
[armeabi-v7a] Compile++ arm  : yoyo <= gml_Object_object6_Create_0.gml.cpp
[armeabi-v7a] Compile++ arm  : yoyo <= gml_Object_object6_PreCreate_0.gml.cpp
[armeabi-v7a] Compile++ arm  : yoyo <= gml_Object_object7_Create_0.gml.cpp
[armeabi-v7a] Compile++ arm  : yoyo <= gml_Object_object7_Collision_2a4cd23a_86b5_482a_8363_ac32e113379f.gml.cpp
[armeabi-v7a] Compile++ arm  : yoyo <= gml_Object_object6_Step_0.gml.cpp
[armeabi-v7a] Compile++ arm  : yoyo <= gml_Object_object7_PreCreate_0.gml.cpp
[armeabi-v7a] Compile++ arm  : yoyo <= gml_Object_object8_PreCreate_0.gml.cpp
[armeabi-v7a] Compile++ arm  : yoyo <= gml_Object_object8_Collision_2a4cd23a_86b5_482a_8363_ac32e113379f.gml.cpp
[armeabi-v7a] Compile++ arm  : yoyo <= gml_Object_object9_PreCreate_0.gml.cpp
[armeabi-v7a] Compile++ arm  : yoyo <= gml_Object_object9_Collision_2a4cd23a_86b5_482a_8363_ac32e113379f.gml.cpp
[armeabi-v7a] Compile++ arm  : yoyo <= gml_Object_object91_PreCreate_0.gml.cpp
[armeabi-v7a] Compile++ arm  : yoyo <= gml_Object_object91_Collision_2a4cd23a_86b5_482a_8363_ac32e113379f.gml.cpp
[armeabi-v7a] Compile++ arm  : yoyo <= gml_Object_object10_Create_0.gml.cpp
[armeabi-v7a] Compile++ arm  : yoyo <= gml_Object_object91_Step_0.gml.cpp
[armeabi-v7a] Compile++ arm  : yoyo <= gml_Object_object10_PreCreate_0.gml.cpp
[armeabi-v7a] Compile++ arm  : yoyo <= gml_Object_object11_PreCreate_0.gml.cpp
[armeabi-v7a] Compile++ arm  : yoyo <= gml_Object_object13_Create_0.gml.cpp
[armeabi-v7a] Compile++ arm  : yoyo <= gml_Object_object12_Create_0.gml.cpp
[armeabi-v7a] Compile++ arm  : yoyo <= gml_Object_object12_PreCreate_0.gml.cpp
[armeabi-v7a] Compile++ arm  : yoyo <= gml_Object_object13_PreCreate_0.gml.cpp
[armeabi-v7a] Compile++ arm  : yoyo <= gml_Object_object12_Step_0.gml.cpp
[armeabi-v7a] Compile++ arm  : yoyo <= Timeline_timeline0_0.gml.cpp
[armeabi-v7a] Compile++ arm  : yoyo <= wild_clumsy_squeak.vars.cpp
[arm64-v8a] Compile++      : yoyo <= gml_Object_object0_Create_0.gml.cpp
[arm64-v8a] Compile++      : yoyo <= gml_Object_object0_PreCreate_0.gml.cpp
[arm64-v8a] Compile++      : yoyo <= gml_Object_object0_Other_40.gml.cpp
[arm64-v8a] Compile++      : yoyo <= gml_Object_Next_room_obj_Create_0.gml.cpp
[arm64-v8a] Compile++      : yoyo <= gml_Object_object0_Mouse_53.gml.cpp
[arm64-v8a] Compile++      : yoyo <= gml_Object_Next_room_obj_PreCreate_0.gml.cpp
[arm64-v8a] Compile++      : yoyo <= gml_Object_object0_Step_0.gml.cpp
[arm64-v8a] Compile++      : yoyo <= gml_Object_object2_Create_0.gml.cpp
[arm64-v8a] Compile++      : yoyo <= gml_Object_object2_PreCreate_0.gml.cpp
[arm64-v8a] Compile++      : yoyo <= gml_Object_Control_room_ob_Create_0.gml.cpp
[arm64-v8a] Compile++      : yoyo <= gml_Object_Control_room_ob_Alarm_0.gml.cpp
[arm64-v8a] Compile++      : yoyo <= gml_Object_Control_room_ob_PreCreate_0.gml.cpp
[arm64-v8a] Compile++      : yoyo <= gml_Object_Control_room_ob_Step_0.gml.cpp
[arm64-v8a] Compile++      : yoyo <= gml_Object_object4_PreCreate_0.gml.cpp
[arm64-v8a] Compile++      : yoyo <= gml_Object_object4_Create_0.gml.cpp
[arm64-v8a] Compile++      : yoyo <= gml_Object_object4_Collision_2a4cd23a_86b5_482a_8363_ac32e113379f.gml.cpp
[arm64-v8a] Compile++      : yoyo <= gml_Object_object5_Create_0.gml.cpp
[arm64-v8a] Compile++      : yoyo <= gml_Object_object5_PreCreate_0.gml.cpp
[arm64-v8a] Compile++      : yoyo <= gml_Object_object6_Create_0.gml.cpp
[arm64-v8a] Compile++      : yoyo <= gml_Object_object6_Step_0.gml.cpp
[arm64-v8a] Compile++      : yoyo <= gml_Object_object6_PreCreate_0.gml.cpp
[arm64-v8a] Compile++      : yoyo <= gml_Object_object7_Create_0.gml.cpp
[arm64-v8a] Compile++      : yoyo <= gml_Object_object7_PreCreate_0.gml.cpp
[arm64-v8a] Compile++      : yoyo <= gml_Object_object7_Collision_2a4cd23a_86b5_482a_8363_ac32e113379f.gml.cpp
[arm64-v8a] Compile++      : yoyo <= gml_Object_object8_Collision_2a4cd23a_86b5_482a_8363_ac32e113379f.gml.cpp
[arm64-v8a] Compile++      : yoyo <= gml_Object_object8_PreCreate_0.gml.cpp
[arm64-v8a] Compile++      : yoyo <= gml_Object_object9_Collision_2a4cd23a_86b5_482a_8363_ac32e113379f.gml.cpp
[arm64-v8a] Compile++      : yoyo <= gml_Object_object9_PreCreate_0.gml.cpp
[arm64-v8a] Compile++      : yoyo <= gml_Object_object91_Step_0.gml.cpp
[arm64-v8a] Compile++      : yoyo <= gml_Object_object91_PreCreate_0.gml.cpp
[arm64-v8a] Compile++      : yoyo <= gml_Object_object91_Collision_2a4cd23a_86b5_482a_8363_ac32e113379f.gml.cpp
[arm64-v8a] Compile++      : yoyo <= gml_Object_object10_Create_0.gml.cpp
[arm64-v8a] Compile++      : yoyo <= gml_Object_object10_PreCreate_0.gml.cpp
[arm64-v8a] Compile++      : yoyo <= gml_Object_object11_PreCreate_0.gml.cpp
[arm64-v8a] Compile++      : yoyo <= gml_Object_object12_Create_0.gml.cpp
[arm64-v8a] Compile++      : yoyo <= gml_Object_object12_PreCreate_0.gml.cpp
[arm64-v8a] Compile++      : yoyo <= gml_Object_object12_Step_0.gml.cpp
[arm64-v8a] Compile++      : yoyo <= gml_Object_object13_Create_0.gml.cpp
[armeabi-v7a] Install        : libc++_shared.so => Y:/wild_clumsy_squeak_688CBCBC_YYC/lib/armeabi-v7a/libc++_shared.so
[arm64-v8a] Compile++      : yoyo <= gml_Object_object13_PreCreate_0.gml.cpp
[arm64-v8a] Install        : libc++_shared.so => Y:/wild_clumsy_squeak_688CBCBC_YYC/lib/arm64-v8a/libc++_shared.so
[arm64-v8a] Compile++      : yoyo <= wild_clumsy_squeak.vars.cpp
[arm64-v8a] Compile++      : yoyo <= Timeline_timeline0_0.gml.cpp
[armeabi-v7a] SharedLibrary  : libyoyo.so
[arm64-v8a] SharedLibrary  : libyoyo.so
Z:\wild_clums_E71572DB_80BECD1F\wild clumsy squeak\default\Scripts\llvm-android>set /p exitcode= 0<exitcode.txt
Z:\wild_clums_E71572DB_80BECD1F\wild clumsy squeak\default\Scripts\llvm-android>exit /b %exitcode%
Z:\wild_clums_E71572DB_80BECD1F\wild clumsy squeak\default\Scripts\llvm-android>exit /b 2 
Z:\wild_clums_E71572DB_80BECD1F\wild clumsy squeak\default\Scripts\llvm-android>
Stats : GMA : Elapsed=7988,4569
Stats : GMA : sp=22,au=3,bk=0,pt=0,sc=0,sh=0,fo=0,tl=1,ob=22,ro=4,da=0,ex=1,ma=72,fm=0x300000600020


X://bin/GMAssetCompiler.exe exited with non-zero status (2)
"cmd"  /c subst Z: /d

elapsed time 00:00:37.0671201s for command "C:\ProgramData/GameMakerStudio2/Cache/runtimes\runtime-2.2.4.374/bin/Igor.exe" -j=8 -options="C:\Users\Groster\AppData\Local\GameMakerStudio2\GMS2TEMP\build.bff" -v -- Android Package started at 06/11/2020 00:09:44
elapsed time 00:00:00.0230013s for command "cmd" /c subst Z: /d started at 06/11/2020 00:10:21
"cmd"  /c subst Y: /d

elapsed time 00:00:00.0250015s for command "cmd" /c subst Y: /d started at 06/11/2020 00:10:21
"cmd"  /c subst X: /d

elapsed time 00:00:00.0210012s for command "cmd" /c subst X: /d started at 06/11/2020 00:10:21
---------- STOPPING ----------
FAILED: Package Program Complete
 

chirpy

Member
If by "NDK out" you meant the min SDK warning [*], you probably don't need to care about it. As long as you don't need to support Android 14-15 (Android 4.0.1-4.0.4), releasing a game with min SDK 16 will filter out devices with OS version lower than Android 4.1.

That said, if you had migrated from old Android Studio to newer 3.5+ versions like I once did: I would recommend a clean install to wipe out unwanted old binaries and environment settings.

From your first post, the real issue is "Could not set process working directory to 'V:\com.company.game': could not set current directory (errno 3)"
Your last log somehow didn't show a meaningful message, only GMAssetCompiler failing with exit code 2.

[*] "Android NDK: android-14 is unsupported. Using minimum supported version android-16."
 

Groster

Member
My problem is that the extension of Google services does not allow compilation.
Without google extension service, this error is not issued.
This happens on both 2.2.4 and 2.2.5.
The assembly simply stops for a moment from the code of my last message and does not compile further.
This is an absolutely new clean project.
This project has been repeatedly tested on my device running Android 9.
I.e. Everything works perfectly while there are no extensions from Google.
Me in my project really need these services.
Therefore, I’m looking for how to fix or get around this problem.
 

jayant756

Member
If by "NDK out" you meant the min SDK warning [*], you probably don't need to care about it. As long as you don't need to support Android 14-15 (Android 4.0.1-4.0.4), releasing a game with min SDK 16 will filter out devices with OS version lower than Android 4.1.

That said, if you had migrated from old Android Studio to newer 3.5+ versions like I once did: I would recommend a clean install to wipe out unwanted old binaries and environment settings.

From your first post, the real issue is "Could not set process working directory to 'V:\com.company.game': could not set current directory (errno 3)"
Your last log somehow didn't show a meaningful message, only GMAssetCompiler failing with exit code 2.

[*] "Android NDK: android-14 is unsupported. Using minimum supported version android-16."




I have the same issue please help me with it
"Could not set process working directory to 'V:\com.company.game': could not set current directory (errno 3)"
 
Top