error

  1. I

    Android Android compile error - global tap event is the cause

    Problem: I been trying to build for android using yyc and I keep getting this error Compile errors: Object: obj_ibisflight Event: Global Tap at line 1 : Fatal Error while compiling gml_Object_obj_ibisflight_Gesture_64 - bailing details below Output: collapsing enums. Error ...
  2. K

    String and Ds_Map

    Okay, Basically, what I'm trying to do is the following: I want to create a string that uses a variable in it. The variable is stored inside a Ds_Map When I try to run the game this happens: ___________________________________________...
  3. ShadowLenz

    Windows Making an RPG [PROBLEM FIXED ]

    hi! i'm currently making an RPG and when i established the movement, and solids collision, the firs room map and else, was the time for a new room, so i created a second room, and when i created: the obj_next and obj_last (for tracking back to the previous room) and go to the "step event" of...
  4. T

    Android Please Help. Gradle Error

    My app was working fine a few months ago, but now out of no where when I build to Android I get this: Windows build works fine. p.s. I can't get that stupid smiley face to go away in the Execution failed line.
  5. M

    Drawn shadows overlapping issue

    So in my top-down viewed game, I have cloud shadows (transparent sprites) that occasionally fly over the levels. They overlap tho, causing the overlapping section to go dark, and it looks bad. I tried learning to use Surfaces to overcome this issue..... but honestly i dont have much clue how to...
  6. Kingdom Of Key

    GMS 2.3+ Sprite Animation Don't Move

    My Animation Sprite Don't Move , I Looked At The Mask Collisions And Origin ,Still Doesn't Work script_execute(get_input) //Move yx = (key_up - key_down) xy = (key_left - key_right) //Speed if (xy == 0) and (yx == 0 ) { len =0; } else { len = spd } //Direction var dir =...
  7. mbeytekin

    file_text_open_read() doesn't open file for reading with associated files

    My code like this if projectfile = "" || !file_exists(projectfile) { exit; } var _fname=file_text_open_read(projectfile) ... as you see I checked file exists and then open it for reading. Normally it works, but if I try to double click my programs own associated file and...
  8. B

    Android This release not are compatible with 64 bits

    hello i created my .aab game in GMS2 with this architecture Armv7, x86, Arm64 and x86 64. but when i upload to the google ap store i receid this error Warning This release is not compliant with the Google Play 64-bit requirement The following APKs or App Bundles are available to 64-bit...
  9. F

    Question - IDE Can't install GMS 2.3 mobile

    I got my mobile license and when it tries to install on GMS 2.3 it keeps showing error at the end of installation. It did work before I got GMS mobile and there is no problem with GMS 2, I happened only to 2.3 version.
  10. If Programable_Matter

    Loading JSON info Error

    I keep getting this Error even though the program successfuly uploaded the JSON key :values Apparently the code works and the values show up in my program but like 2 seconds later I get this error. I'm pretty sure I'm missing some code Create Event http_get("http://webpage.json")...
  11. PhenomenalDev

    Legacy GM Attempting to use Fortran dll with GMS1, having issues

    I have produced a dll with gfortran that performs a basic function (shown below) and have attempted to write code to interface with it but I get the classic 'error defining external function' when I attempt to define a function from it and I'm not sure why. I know the function is exposed as I've...
  12. acuacu52699

    Mac OSX GMS Run Error- Port Error

    Hi, I hope I am correct in this thread. I downloaded the GMS for Mac for the first time today and read a bit. Now I wanted to start my project and the following message appears: FAILED: Run Program Complete For the details of why this build failed, please review the whole log above and also...
  13. acuacu52699

    Run Error

    Hi, I hope I am correct in this thread. I downloaded the GMS for Mac for the first time today and read a bit. Now I wanted to start my project and the following message appears: FAILED: Run Program Complete For the details of why this build failed, please review the whole log above and also...
  14. S

    Windows Gamemaker studio 2 login problems

    Hi guys Everytime I logon to my gamemaker studio 2 it says "Error: session not found" This has been a problem for me for months. someone please help me Things I have tried: reinstall gamemaker, reboot computer, delete um.json located in AppData\Roaming\GameMakerStudio2 using another GMS2...
  15. TreysterGames

    This is still happening :(

    Come on man. I was just trying to make a game, but whenever I import a sprite this happens! I restarted my PC uninstalled and re-installed GMS2, and this is still occurring! I don't understand, and any feedback would be helpful! I'm sure if its the file size or what, but I made these sprites in...
  16. TreysterGames

    Question - IDE Failed to Import Chosen Files Continuous Error

    Whenever I try to import a sprite into my resources panel, I keep getting the import failure response. It's been happening lately and has been inconsistent for when it occurs, I don't know why it happens, but I could really use some advice for how to fix these pop-ups, thank you! (I'm also...
  17. F

    Dialogue System need Help

    Hey guys I'm new to Game Maker Studio and new to the language. I'm making a game and have been working on the dialogue system. This chunk of code was designed for characters respond to a set of choices, the dialogue starts by printing out the first element of the line_array, which it does, then...
  18. Mookal

    SOLVED iOS Export: Connection Successful, No Devices Found

    I'm developing my game on my Windows PC, and I have a Mac set up with Xcode for testing the iOS export. I hadn't tested in a while so I tried to send a build to the Mac, but I kept getting the "FAILED: Run Program Complete" error. I then tried to search for iOS devices connected to the Mac...
  19. duran can

    SOLVED Although I enter 4 arguments it shows 5

    and getting error, whats wrong?
  20. Zhanghua

    SOLVED [For Help] Failure to upload asset to MarketPlace

    Can't insert an image in the post..and the Error image is in the attachments. 1. When I upload the asset package in the IDE, It responds the message of "Package upload failed: The remote server returned an error:(504) Gateway Timeout" 2.Then I use the browser to acess the...
Top