build failed

  1. Lê Tuấn Anh

    Android / Amazon Fire Build Android failed

    After build android, output show C:\WINDOWS\system32\cmd.exe /c "subst T: "Z:/SocketIO_403D62CE\Android\default" && T: && cd "com.exception.socketio" && "X:/Android\runner\gradle\gradlew" build assembleRelease -x lint " Exception in thread "main" java.lang.NullPointerException at...
  2. Arthur521

    I can't do a build for old android versions!

    Hi! I am developing a game for android, and I am having certain issues to build for versions below Android 9.0, here are images: Here is the Output after the "Build Failed": Saving project to: C:\Users\arthu\Desktop\projeto_celebre\CELEBRE\CELEBRE.yyp "cmd" /c subst Z...
  3. N

    BUILD FAILED

    Hi, i am new with GMS 2, first time i am creating apk, but i got this error, can any one please tell me what is wrong. required: byte[],byte[],int,int found: <null>,int,Integer reason: actual and formal argument lists differ in length Note: Some input files use or override a deprecated...
  4. L

    iOS Build Failing - Could not find Archive

    Hello, I have a Mac-mini setup for iOS exports, was working properly until today. This is the first build attempt since last MacOS and XCode update that happened last month, Everything was working fine before that. System.Exception: could not find archive at ..(String , String ...
  5. R

    Android / Amazon Fire GMS2 Android Full Screen & Build Error

    My Android game is ready for beta testing however I can't seem to get the app to full screen. I am currently testing it on a Samsung Galaxy S8 and it currently fills up most of the screen but not all of it. Is this something hidden deep within the settings or a built-in function that must be...
  6. V

    Android / Amazon Fire After deleting extention build failed

    Hi, I dont know why, but if i delete any extention it dont work any more, only build failed. For example, i delete "Amazon GameCircle". Y:\com.virtualivin.shadyalley\src\main\AndroidManifest.xml:38:3-99:17 Warning: application@android:label was tagged at AndroidManifest.xml:38 to replace...
  7. mb10

    Android / Amazon Fire [SOLVED] "BUILD FAILED" after cleaning cache.

    So running my game on Android was working fine until i mistakenly clicked the clean cache icon and suddenly i started getting "BUILD FAILED" error after a minute of trying to run. While GM is trying to run the game it seems to be stuck at this: FastCreate started: 00:55:38 FastCreate End File...
  8. M

    Android / Amazon Fire Android build error, please help!

    Windows building works fine but for some odd reason android gives this error: [Fatal Error] :28:181: Element type "application" must be followed by either attribute specifications, ">" or "/>". FAILURE: Build failed with an exception. * What went wrong: Exception while parsing the supplied...
  9. N

    Android / Amazon Fire Cannot export? Daemon??

    Hi, this is my compile log: Saving project to: C:\Users\NoFon\Documents\GameMakerStudio2\Dabby Bird Android\Dabby Bird Android.yyp "cmd" /c subst Z: "C:\Users\NoFon\AppData\Roaming\GameMakerStudio2\Cache\GMS2CACHE" elapsed time 00:00:00.3780118s for command "cmd" /c subst Z...
  10. K3llyll

    Android / Amazon Fire GMS1.4 Android BUILD FAILED Issue

    Hello. I have encountered the same problem before in GMS2. But it is SOLVED. https://forum.yoyogames.com/index.php?threads/android-build-failed-problem.49571/#post-306444 But I encountered the same problem now in GMS1.4 . I use both GMS1.4 and GMS2. I set the same thing in GMS1.4 But it didn't...
  11. K3llyll

    Android / Amazon Fire [SOLVED]Android Build Failed Problem :(

    I tried to export my game for Android all day. But it didn't work. I have installed many different SDK, NDK and JDK versions. But it didn't work again. I have encountered the same problem in GMS 1.4 before. But when I created a new project, it was fixed. But now, I encountered the same problem...
  12. S

    Build failed error to create android file, please reply

    C:\Users\LENOVO\AppData\Local\Android\Sdk\tools\ant\build.xml:538: Unable to resolve project target 'Google Inc.:Google APIs:13' When I am trying to create application for my project saving it as .apk file I am getting the above error, I have also attached the image so you guys may get an idea...
  13. K3llyll

    Android / Amazon Fire Android BUILD FAILED Problem ?

    Previously, there is SDK on my PC. And I could use it comfortably. Then I deleted the SDK. After a long time, I installed the SDK again. But there is something wrong. I'm using GMS1.4 and GMS2. When I try to convert the project to APK, it fails. SDK, NDK , JDK , Keystore is OK. I searched and I...
  14. J

    Android / Amazon Fire Build Failed, Could not find com.android.support:support-v4:27.0.1

    Yesterday my project works fine, however today after i changed package name and version on GGS Android/Fire I now get the following error FAILURE: Build failed with an exception. * What went wrong: A problem occurred configuring project ':com.company.game'. > Could not resolve all dependencies...
  15. logan12v

    Android / Amazon Fire what is the support library version for build tools 27.0.1

    i keep getting build FAILURE: Build failed with an exception. * What went wrong: A problem occurred configuring project ':com.company.game'. > Could not resolve all dependencies for configuration ':com.company.game:_debugApkCopy'. > Could not find com.android.support:support-v4:27.0.1. ///...
  16. G

    Android / Amazon Fire [Workaround] Android build fails with AVD, unknown package error

    When I try to run on an AVD (the default Nexus one) that is visibly running, that is detected by GMS2, the build fails for the silly reason that it can't uninstall my game's package from the device. Here is the error under the spoiler: Of course the package isn't there! But I don't know how...
  17. B

    Android / Amazon Fire BUILD FAILED Cannot find build.xml

    I am using Gamemaker Studio v1.4.1657 because I am trying to test a project on Android TV and the newest 1.4 builds give an "Incorrect Android target" error when testing the APK on my Nvidia Shield TV. I can build successfully on the newer 1.4 builds but on v.1.4.1657 build this occurs: BUILD...
  18. C

    Legacy GM Android Build Failed

    Finally ready to test my game on an Android device. Downloaded a ton of APIs. SDK, JDK, Keystore, and NDK Version r13b (64-bit) OK. As well, Target SDK: 23. Min SDK: 9. Compile SDK: 23. Build Tools: 23.0.3. Support Lib: 23.1.1. Why do I get this error? * What went wrong: Execution failed for...
  19. N

    Android / Amazon Fire Build fail on Android...

    As someone else mentioned, I have a similar build fail when I add Heyzap extension to my project. "C:\Users\Csabi\AppData\Roaming\GameMaker-Studio\GMAssetCompiler.exe" /fU="C:\Users\Csabi\AppData\Local\gm_ttt_72250\a22675.txt" /c /m=android /config="Default" /tgt=8 /obob=True /obpp=False...
  20. D

    Android / Amazon Fire Can't get GooglePlayServicesExtension to work anymore

    I can't build my app anymore, I'm getting this error: I tried updating to the latest version of GooglePlayServicesExtension and updating the sdk build tools, google repository etc. but that didn't solve the problem
Top